2,3,5,6-Tetrafluorophenol
- Formula: C6H2F4O
- Molecular weight: 166.0731
- IUPAC Standard InChIKey: PBYIIRLNRCVTMQ-UHFFFAOYSA-N
- CAS Registry Number: 769-39-1
- Chemical structure:
View 3d structure (requires JavaScript / HTML 5) - Other names: Phenol, 2,3,5,6-tetrafluoro-

Phase change data

Data compiled by: Robert L. Brown and Stephen E. Stein
Quantity | Value | Units | Method | Reference | Comment |
---|---|---|---|---|---|
Tboil | 415. | K | N/A | PCR Inc., 1990 | |
Tboil | 413.2 | K | N/A | Weast and Grasselli, 1989 |

Reaction thermochemistry data

Data compiled by: John E. Bartmess
Individual Reactions
C6HF4O- + =
By formula: C6HF4O- + H+ = C6H2F4O
Quantity | Value | Units | Method | Reference | Comment |
---|---|---|---|---|---|
ΔrH° | 1410. ± 12. | kJ/mol | D-EA | Hernandez-Gill, Wentworth, et al., 1984 | gas phase; Probably ca. 10 kcal/mol more acidic than this, based on substituent effects - JEB |

Gas phase ion energetics data

Data compiled as indicated in comments:
B - John E. Bartmess
LLK - Sharon G. Lias, Rhoda D. Levin, and Sherif A. Kafafi
Ionization energy determinations
IE (eV) | Method | Reference | Comment |
---|---|---|---|
9.40 ± 0.02 | PE | Maier, Marthaler, et al., 1980 | Vertical value; LLK |
De-protonation reactions
C6HF4O- + =
By formula: C6HF4O- + H+ = C6H2F4O
Quantity | Value | Units | Method | Reference | Comment |
---|---|---|---|---|---|
ΔrH° | 1410. ± 12. | kJ/mol | D-EA | Hernandez-Gill, Wentworth, et al., 1984 | gas phase; Probably ca. 10 kcal/mol more acidic than this, based on substituent effects - JEB; B |

References

PCR Inc., 1990
PCR Inc.,
Research Chemicals Catalog 1990-1991, PCR Inc., Gainesville, FL, 1990, 1. [all data]
Weast and Grasselli, 1989
CRC Handbook of Data on Organic Compounds, 2nd Editon, Weast,R.C and Grasselli, J.G., ed(s)., CRC Press, Inc., Boca Raton, FL, 1989, 1. [all data]
Hernandez-Gill, Wentworth, et al., 1984
Hernandez-Gill, N.; Wentworth, W.E.; Chen, E.C.M.,
Electron affinities of fluorinated phenoxy radicals,
J. Phys. Chem., 1984, 88, 6181. [all data]
Maier, Marthaler, et al., 1980
Maier, J.P.; Marthaler, O.; Mohraz, M.,
Emission spectra of the cations of some fluorosubstituted phenols in the gaseous phase,
J. Electron Spectrosc. Relat. Phenom., 1980, 19, 11. [all data]