potassium hydride
- Formula: HK
- Molecular weight: 40.1062
- IUPAC Standard InChIKey: NTTOTNSKUYCDAV-UHFFFAOYSA-N
- CAS Registry Number: 7693-26-7
- Chemical structure:

Condensed phase thermochemistry data

Quantity | Value | Units | Method | Reference | Comment |
---|---|---|---|---|---|
ΔfH°solid | -57.82 | kJ/mol | Review | Chase, 1998 | Data last reviewed in March, 1963 |
Quantity | Value | Units | Method | Reference | Comment |
S°solid | 50.18 | J/mol*K | Review | Chase, 1998 | Data last reviewed in March, 1963 |
Solid Phase Heat Capacity (Shomate Equation)
Cp° = A + B*t + C*t2 + D*t3 +
E/t2
H° − H°298.15= A*t + B*t2/2 +
C*t3/3 + D*t4/4 − E/t + F − H
S° = A*ln(t) + B*t + C*t2/2 + D*t3/3 −
E/(2*t2) + G
Cp = heat capacity (J/mol*K)
H° = standard enthalpy (kJ/mol)
S° = standard entropy (J/mol*K)
t = temperature (K) / 1000.
View plot Requires a JavaScript / HTML 5 canvas capable browser.
Temperature (K) | 298. to 1500. |
---|---|
A | 28.28279 |
B | 60.56758 |
C | -36.41034 |
D | 7.935751 |
E | -0.480344 |
F | -70.26024 |
G | 65.19509 |
H | -57.81995 |
Reference | Chase, 1998 |
Comment | Data last reviewed in March, 1963 |

Gas phase ion energetics data

Data compiled as indicated in comments:
B - John E. Bartmess
LBLHLM - Sharon G. Lias, John E. Bartmess, Joel F. Liebman, John L. Holmes, Rhoda D. Levin, and W. Gary Mallard
Ionization energy determinations
IE (eV) | Method | Reference | Comment |
---|---|---|---|
8.0 ± 1.0 | S | Farber, Srivastava, et al., 1982 | LBLHLM |
De-protonation reactions
K- + =
Quantity | Value | Units | Method | Reference | Comment |
---|---|---|---|---|---|
ΔrH° | 1439.840 ± 0.042 | kJ/mol | D-EA | Andersson, Sandstrom, et al., 2000 | gas phase; Given: 0.501459(12) eV; B |
Quantity | Value | Units | Method | Reference | Comment |
ΔrG° | 1420.4 ± 1.3 | kJ/mol | H-TS | Andersson, Sandstrom, et al., 2000 | gas phase; Given: 0.501459(12) eV; B |

Gas phase thermochemistry data

Quantity | Value | Units | Method | Reference | Comment |
---|---|---|---|---|---|
ΔfH°gas | 123.01 | kJ/mol | Review | Chase, 1998 | Data last reviewed in March, 1963 |
Quantity | Value | Units | Method | Reference | Comment |
S°gas,1 bar | 198.02 | J/mol*K | Review | Chase, 1998 | Data last reviewed in March, 1963 |
Gas Phase Heat Capacity (Shomate Equation)
Cp° = A + B*t + C*t2 + D*t3 +
E/t2
H° − H°298.15= A*t + B*t2/2 +
C*t3/3 + D*t4/4 − E/t + F − H
S° = A*ln(t) + B*t + C*t2/2 + D*t3/3 −
E/(2*t2) + G
Cp = heat capacity (J/mol*K)
H° = standard enthalpy (kJ/mol)
S° = standard entropy (J/mol*K)
t = temperature (K) / 1000.
View plot Requires a JavaScript / HTML 5 canvas capable browser.
Temperature (K) | 298. to 1100. | 1100. to 6000. |
---|---|---|
A | 23.20149 | 37.25316 |
B | 34.07332 | 1.023173 |
C | -29.73176 | -0.018147 |
D | 9.533328 | 0.001255 |
E | 0.005323 | -1.174659 |
F | 114.8391 | 108.6116 |
G | 217.2082 | 237.9888 |
H | 123.0100 | 123.0100 |
Reference | Chase, 1998 | Chase, 1998 |
Comment | Data last reviewed in March, 1963 | Data last reviewed in March, 1963 |

Reaction thermochemistry data

Data compiled by: John E. Bartmess
Individual Reactions
K- + =
Quantity | Value | Units | Method | Reference | Comment |
---|---|---|---|---|---|
ΔrH° | 344.130 ± 0.010 | kcal/mol | D-EA | Andersson, Sandstrom, et al., 2000 | gas phase; Given: 0.501459(12) eV |
Quantity | Value | Units | Method | Reference | Comment |
ΔrG° | 339.48 ± 0.30 | kcal/mol | H-TS | Andersson, Sandstrom, et al., 2000 | gas phase; Given: 0.501459(12) eV |

Constants of diatomic molecules

Data compiled by: Klaus P. Huber and Gerhard H. Herzberg

Data collected through January, 1977

Symbols used in the table of constants
SymbolMeaning
State electronic state and / or symmetry symbol
Te minimum electronic energy (cm-1)
ωe vibrational constant – first term (cm-1)
ωexe vibrational constant – second term (cm-1)
ωeye vibrational constant – third term (cm-1)
Be rotational constant in equilibrium position (cm-1)
αe rotational constant – first term (cm-1)
γe rotation-vibration interaction constant (cm-1)
De centrifugal distortion constant (cm-1)
βe rotational constant – first term, centrifugal force (cm-1)
re internuclear distance (Å)
Trans. observed transition(s) corresponding to electronic state
ν00 position of 0-0 band (units noted in table)
Diatomic constants for 39KH
StateTeωeωexeωeyeBeαeγeDeβereTrans.ν00
Theoretical potential energy curves, coupling between molecular states Numrich and Truhlar, 1975.
Fluctuating continuum in emission, 25000 - 33000 cm-1.
Hori, 1933
A 1Σ+ 19052.8 228.2 Z -5.75 1  1.269 -0.0375 2  9.5E-5  3.68 A 3 ↔ X R 188680.1 Z
Almy and Hause, 1932; Hori, 1933, 2; Almy and Beiler, 1942; Bartky, 1966
X 2Σ+ 0 983.6 Z 14.32  3.4123 0.0817  15.3E-5  2.2425

References

Chase, 1998
Chase, M.W., Jr.,
NIST-JANAF Themochemical Tables, Fourth Edition,
J. Phys. Chem. Ref. Data, Monograph 9, 1998, 1-1951. [all data]
Farber, Srivastava, et al., 1982
Farber, M.; Srivastava, R.D.; Moyer, J.W.,
Mass spectrometric determination of the thermodynamics of potassium hydroxide and minor potassium-containing species required in magnetohydrodynamic power systems,
J. Chem. Thermodyn., 1982, 14, 1103. [all data]
Andersson, Sandstrom, et al., 2000
Andersson, K.T.; Sandstrom, J.; Kiyan, I.Y.; Hanstorp, D.; Pegg, D.J.,
Measurement of the electron affinity of potassium - art. no. 022503,
Phys. Rev. A, 2000, 62, 2, 22503, https://doi.org/10.1103/PhysRevA.62.022503
. [all data]