Benzene, 2-ethenyl-1,3,5-trimethyl-
- Formula: C11H14
- Molecular weight: 146.2289
- IUPAC Standard InChIKey: PDELBHCVXBSVPJ-UHFFFAOYSA-N
- CAS Registry Number: 769-25-5
- Chemical structure:
View 3d structure (requires JavaScript / HTML 5) - Other names: Styrene, 2,4,6-trimethyl-; Mesitylethylene; Vinylmesitylene; 2-Vinylmesitylene; 2,4,6-Trimethylstyrene; 1,3,5-Trimethyl-2-vinylbenzene

Phase change data

Data compiled as indicated in comments:
BS - Robert L. Brown and Stephen E. Stein
TRC - Thermodynamics Research Center, NIST Boulder Laboratories, Chris Muzny director
AC - William E. Acree, Jr., James S. Chickos
Quantity | Value | Units | Method | Reference | Comment |
---|---|---|---|---|---|
Tboil | 482.2 | K | N/A | Weast and Grasselli, 1989 | BS |
Tboil | 477. | K | N/A | Klages, 1903 | Uncertainty assigned by TRC = 5. K; TRC |
Quantity | Value | Units | Method | Reference | Comment |
Tfus | 236.15 | K | N/A | Buck, Coles, et al., 1949 | Uncertainty assigned by TRC = 0.5 K; TRC |
Enthalpy of vaporization
ΔvapH (kJ/mol) | Temperature (K) | Method | Reference | Comment |
---|---|---|---|---|
50.9 | 377. | A | Stephenson and Malanowski, 1987 | Based on data from 362. to 483. K. See also Buck, Coles, et al., 1949, 2.; AC |
Antoine Equation Parameters
log10(P) = A − (B / (T + C))
P = vapor pressure (bar)
T = temperature (K)
View plot Requires a JavaScript / HTML 5 canvas capable browser.
Temperature (K) | A | B | C | Reference | Comment |
---|---|---|---|---|---|
363.1 to 481.1 | 4.26105 | 1741.148 | -72.771 | Buck, Coles, et al., 1949, 3 | Coefficents calculated by NIST from author's data. |

Gas phase ion energetics data

Data compiled by: Sharon G. Lias, Rhoda D. Levin, and Sherif A. Kafafi
Ionization energy determinations
IE (eV) | Method | Reference | Comment |
---|---|---|---|
8.33 | PE | Kobayashi, Yokota, et al., 1973 | Vertical value |

References

Weast and Grasselli, 1989
CRC Handbook of Data on Organic Compounds, 2nd Editon, Weast,R.C and Grasselli, J.G., ed(s)., CRC Press, Inc., Boca Raton, FL, 1989, 1. [all data]
Klages, 1903
Klages, A.,
Ber. Dtsch. Chem. Ges., 1903, 36, 3688. [all data]
Buck, Coles, et al., 1949
Buck, F.R.; Coles, K.F.; Kennedy, G.T.; Morton, F.,
Some Nuclear-methylated Styrenes and Related Compounds,
J. Chem. Soc., 1949, 1949, 2377-83. [all data]
Stephenson and Malanowski, 1987
Stephenson, Richard M.; Malanowski, Stanislaw,
Handbook of the Thermodynamics of Organic Compounds, 1987, https://doi.org/10.1007/978-94-009-3173-2
. [all data]
Buck, Coles, et al., 1949, 2
Buck, F.R.; Coles, K.F.; Kennedy, G.T.; Morton, F.,
502. Some nuclear-methylated styrenes and related compounds. Part I,
J. Chem. Soc., 1949, 2377, https://doi.org/10.1039/jr9490002377
. [all data]
Buck, Coles, et al., 1949, 3
Buck, F.R.; Coles, K.F.; Kennedy, G.T.; Morton, F.,
Some Nuclear-methylated Styrenes and Related Compounds,
J. Chem. Soc., 1949, 2377-2383, https://doi.org/10.1039/jr9490002377
. [all data]
Kobayashi, Yokota, et al., 1973
Kobayashi, T.; Yokota, K.; Nagakura, S.,
Photoelectron spectra of styrenes,
J. Electron Spectrosc. Relat. Phenom., 1973, 3, 449. [all data]