1-Adamantanol
- Formula: C10H16O
- Molecular weight: 152.2334
- IUPAC Standard InChIKey: VLLNJDMHDJRNFK-UHFFFAOYSA-N
- CAS Registry Number: 768-95-6
- Chemical structure:
- Other names: Tricyclo[3.3.1.1(3,7)]decan-1-ol; 1-Adamantol; 1-Hydroxyadamantane; Adamantan-1-ol; Tricyclo(3.3.1.1(3,7))-n-decanol; 1-Adamantyl alcohol; Adamantol-(1); NSC 108837; NSC 91633; tricyclo[3.3.1.13,7]decan-1-ol

Gas phase thermochemistry data

Data compiled by: Hussein Y. Afeefy, Joel F. Liebman, and Stephen E. Stein
Quantity | Value | Units | Method | Reference | Comment |
---|---|---|---|---|---|
ΔfH°gas | -311. ± 3. | kJ/mol | Ccb | Steele, 1979 | |
ΔfH°gas | -311. ± 3. | kJ/mol | Ccb | Arora and Steele, 1978 |

Condensed phase thermochemistry data

Data compiled by: Hussein Y. Afeefy, Joel F. Liebman, and Stephen E. Stein
Quantity | Value | Units | Method | Reference | Comment |
---|---|---|---|---|---|
ΔfH°solid | -397. ± 3. | kJ/mol | Ccb | Arora and Steele, 1978 | |
Quantity | Value | Units | Method | Reference | Comment |
ΔcH°solid | -5824. ± 3. | kJ/mol | Ccb | Arora and Steele, 1978 | Corresponding ΔfHºsolid = -397. kJ/mol (simple calculation by NIST; no Washburn corrections) |

Gas phase ion energetics data

Data compiled as indicated in comments:
LLK - Sharon G. Lias, Rhoda D. Levin, and Sherif A. Kafafi
RDSH - Henry M. Rosenstock, Keith Draxl, Bruce W. Steiner, and John T. Herron
Ionization energy determinations
IE (eV) | Method | Reference | Comment |
---|---|---|---|
9.09 ± 0.05 | PE | Worley, Mateescu, et al., 1973 | LLK |
9.23 | PE | Bodor, Dewar, et al., 1970 | RDSH |

Phase change data

Data compiled as indicated in comments:
TRC - Thermodynamics Research Center, NIST Boulder Laboratories, Chris Muzny director
AC - William E. Acree, Jr., James S. Chickos
ALS - Hussein Y. Afeefy, Joel F. Liebman, and Stephen E. Stein
DRB - Donald R. Burgess, Jr.
CAL - James S. Chickos, William E. Acree, Jr., Joel F. Liebman, Students of Chem 202 (Introduction to the Literature of Chemistry), University of Missouri -- St. Louis
DH - Eugene S. Domalski and Elizabeth D. Hearing
Quantity | Value | Units | Method | Reference | Comment |
---|---|---|---|---|---|
Tfus | 554.2 | K | N/A | Chickos, Braton, et al., 1991 | Uncertainty assigned by TRC = 0.002 K; TRC |
Quantity | Value | Units | Method | Reference | Comment |
ΔvapH° | 14.5 | kcal/mol | GC | van Roon, Parsons, et al., 2002 | AC |
Quantity | Value | Units | Method | Reference | Comment |
ΔsubH° | 20.7 ± 0.05 | kcal/mol | C | Charapennikau, Blokhin, et al., 2003 | AC |
ΔsubH° | 20.7 ± 0.05 | kcal/mol | ME | Charapennikau, Blokhin, et al., 2003 | Based on data from 288. to 323. K.; AC |
ΔsubH° | 20.7 ± 0.6 | kcal/mol | V | Arora and Steele, 1978 | ALS |
ΔsubH° | 20.6 | kcal/mol | N/A | Arora and Steele, 1978 | DRB |
ΔsubH° | 20.7 ± 0.60 | kcal/mol | BG | Arora and Steele, 1978 | AC |
Enthalpy of fusion
ΔfusH (kcal/mol) | Temperature (K) | Reference | Comment |
---|---|---|---|
2.954 | 552.9 | Charapennikau, Blokhin, et al., 2003, 2 | AC |
Entropy of fusion
ΔfusS (cal/mol*K) | Temperature (K) | Reference | Comment |
---|---|---|---|
1.6 | 369.2 | Salman and Abas, 1989 | CAL |
Enthalpy of phase transition
ΔHtrs (kcal/mol) | Temperature (K) | Initial Phase | Final Phase | Reference | Comment |
---|---|---|---|---|---|
0.5975 | 369.16 | crystaline, III | crystaline, II | Salman and Abas, 1989, 2 | DH |
1.704 | 529.16 | crystaline, II | crystaline, I | Salman and Abas, 1989, 2 | DH |
0.5975 | 369.16 | crystaline, III | crystaline, II | Salman and Abas, 1988 | DH |
1.704 | 529.16 | crystaline, II | crystaline, I | Salman and Abas, 1988 | DH |
Entropy of phase transition
ΔStrs (cal/mol*K) | Temperature (K) | Initial Phase | Final Phase | Reference | Comment |
---|---|---|---|---|---|
1.62 | 369.16 | crystaline, III | crystaline, II | Salman and Abas, 1989, 2 | DH |
3.167 | 529.16 | crystaline, II | crystaline, I | Salman and Abas, 1989, 2 | DH |
1.62 | 369.16 | crystaline, III | crystaline, II | Salman and Abas, 1988 | DH |
3.167 | 529.16 | crystaline, II | crystaline, I | Salman and Abas, 1988 | DH |

Kovats' RI, non-polar column, isothermal

View large format table.

Column type Active phase Temperature (C) I Reference Comment
PackedPMS-1000230.1280.Arutyunov, Kudryashov, et al., 2004N2, Chromaton N-AW-DMCS; Column length: 2. m
PackedPMS-1000160.1270.Kurbatova, Moiseev, et al., 1999N2, Chromatron N-AW; Column length: 1. m
PackedApiezon L160.1333.Kurbatova, Moiseev, et al., 1999N2, Chromatron N-AW; Column length: 1. m
PackedPMS-1000160.1270.Kurbatova, Moiseev, et al., 1998Chromaton N-AW; Column length: 1. m
PackedApiezon L160.1333.Kurbatova, Moiseev, et al., 1998Chromaton N-AW; Column length: 1. m
CapillaryOV-101200.1311.Suslov, Rudenko, et al., 1988N2; Column length: 50. m; Column diameter: 0.25 mm
CapillarySE-30145.1268.Burkhard, Vais, et al., 1969N2; Column length: 50. m; Column diameter: 0.27 mm
CapillarySE-30160.1292.Burkhard, Vais, et al., 1969N2; Column length: 50. m; Column diameter: 0.27 mm
CapillarySE-30175.1301.Burkhard, Vais, et al., 1969N2; Column length: 50. m; Column diameter: 0.27 mm
CapillarySE-30190.1313.Burkhard, Vais, et al., 1969N2; Column length: 50. m; Column diameter: 0.27 mm

Kovats' RI, polar column, isothermal

View large format table.

Column type Active phase Temperature (C) I Reference Comment
PackedCarbowax 20M160.1775.Kurbatova, Moiseev, et al., 1999N2, Chromatron N-AW; Column length: 1. m
PackedCarbowax 20M160.1775.Kurbatova, Moiseev, et al., 1998Chromaton N-AW; Column length: 1. m

Normal alkane RI, non-polar column, isothermal

View large format table.

Column type Active phase Temperature (C) I Reference Comment
CapillaryAdamantyl siloxane160.1268.Konstantinova, Berezkin, et al., 200522. m/0.22 mm/0.20 μm, Nitrogen
CapillaryAdamantyl siloxane160.1268.Konstantinova, Berezkin, et al., 2005, 2Nitrogen; Column length: 22. m; Column diameter: 0.22 mm
CapillaryOV-101200.1320.Triska and Vodicka, 1991Column length: 50. m; Column diameter: 0.25 mm
CapillaryOV-101210.1332.Triska and Vodicka, 1991Column length: 50. m; Column diameter: 0.25 mm
CapillaryOV-101220.1341.Triska and Vodicka, 1991Column length: 50. m; Column diameter: 0.25 mm

Normal alkane RI, non-polar column, custom temperature program

View large format table.

Column type Active phase I Reference Comment
CapillaryPolydimethyl siloxane1268.Bayat and Abad, 2011Program: not specified
CapillaryPMS-10001270.Kurbatova, Kolosova, et al., 2000Program: not specified
CapillaryApiezon L1333.Kurbatova, Kolosova, et al., 2000Program: not specified

Normal alkane RI, polar column, custom temperature program

View large format table.

Column type Active phase I Reference Comment
CapillaryCarbowax 20M1775.Kurbatova, Kolosova, et al., 2000Program: not specified

References

Steele, 1979
Steele, W.V.,
Thermochemically determined ΔH°f(g) values for ketones and alcohols,
Private Communication, University of Stirling, Stirling, Scotland, 1979, 0. [all data]
Arora and Steele, 1978
Arora, M.; Steele, W.V.,
The standard enthalpies of formation of adamantanoid compounds 5. Adamantanols and adamantanone,
J. Chem. Thermodyn., 1978, 10, 403-407. [all data]
Worley, Mateescu, et al., 1973
Worley, S.D.; Mateescu, G.D.; McFarland, C.W.; Fort, R.C., Jr.; Sheley, C.F.,
Photoelectron spectra and MINDO-SCF-MO calculations for adamantane and some of its derivatives,
J. Am. Chem. Soc., 1973, 95, 7580. [all data]
Bodor, Dewar, et al., 1970
Bodor, N.; Dewar, M.J.S.; Worley, S.D.,
Photoelectron spectra of molecules. III. Ionization potentials of some cyclic hydrocarbons and their derivatives, and heats of formation and ionization potentials calculated by the MINDO SCF MO method,
J. Am. Chem. Soc., 1970, 92, 19. [all data]