1-Bromoadamantane
- Formula: C10H15Br
- Molecular weight: 215.130
- IUPAC Standard InChIKey: VQHPRVYDKRESCL-UHFFFAOYSA-N
- CAS Registry Number: 768-90-1
- Chemical structure:
View 3d structure (requires JavaScript / HTML 5) - Other names: Tricyclo[3.3.1.1(3,7)-]decane, 1-bromo-; Adamantane, 1-bromo-; Adamantyl bromide; 1-Adamantyl bromide; 1-bromotricyclo[3.3.1.13,7]decane

Gas phase ion energetics data

Data compiled as indicated in comments:
LBLHLM - Sharon G. Lias, John E. Bartmess, Joel F. Liebman, John L. Holmes, Rhoda D. Levin, and W. Gary Mallard
LLK - Sharon G. Lias, Rhoda D. Levin, and Sherif A. Kafafi
Ionization energy determinations
IE (eV) | Method | Reference | Comment |
---|---|---|---|
9.4 | PE | Abeywickrema, Della, et al., 1984 | LBLHLM |
9.30 ± 0.06 | PE | Worley, Mateescu, et al., 1973 | LLK |
9.2 | PE | Mateescu and Workey, 1972 | LLK |
9.63 ± 0.01 | PE | Abeywickrema, Della, et al., 1984 | Vertical value; LBLHLM |
Appearance energy determinations
Ion | AE (eV) | Other Products | Method | Reference | Comment |
---|---|---|---|---|---|
C10H15+ | 9.3 ± 0.2 | Br | PI | Zauer and Takhistov, 1986 | LBLHLM |

Phase change data

Data compiled as indicated in comments:
TRC - Thermodynamics Research Center, NIST Boulder Laboratories, Chris Muzny director
AC - William E. Acree, Jr., James S. Chickos
CAL - James S. Chickos, William E. Acree, Jr., Joel F. Liebman, Students of Chem 202 (Introduction to the Literature of Chemistry), University of Missouri -- St. Louis

Quantity Value Units Method Reference Comment
Tfus396.5KN/AClark, Knox, et al., 1977Crystal phase 1 phase; Uncertainty assigned by TRC = 0.2 K; TRC

Enthalpy of fusion

ΔfusH (kJ/mol) Temperature (K) Method Reference Comment
3.97391.8DSCBazyleva, Blokhin, et al., 2005Based on data from 290. - 430. K.; AC
3.83396.5N/AClark, Knox, et al., 1977AC

Entropy of fusion

ΔfusS (J/mol*K) Temperature (K) Reference Comment
3.15279.Clark, Knox, et al., 1977CAL
22.32310.5
9.66396.5

In addition to the Thermodynamics Research Center (TRC) data available from this site, much more physical and chemical property data is available from the following TRC products:

References

Abeywickrema, Della, et al., 1984
Abeywickrema, R.S.; Della, E.W.; Pigou, P.E.; Livett, M.K.; Peel, J.B.,
Orbital interactions in some polycycloalkyl halides: A photoelectron spectroscopic study,
J. Am. Chem. Soc., 1984, 106, 7321. [all data]
Worley, Mateescu, et al., 1973
Worley, S.D.; Mateescu, G.D.; McFarland, C.W.; Fort, R.C., Jr.; Sheley, C.F.,
Photoelectron spectra and MINDO-SCF-MO calculations for adamantane and some of its derivatives,
J. Am. Chem. Soc., 1973, 95, 7580. [all data]
Mateescu and Workey, 1972
Mateescu, G.D.; Workey, S.D.,
Electron spectroscipy. II. Photoelectron spectra of adamantane and 1-bromoadamantane,,
Tetrahedron Lett., 1972, 52, 5285. [all data]
Zauer and Takhistov, 1986
Zauer, O.A.; Takhistov, V.V.,
Heats of formation of 1-adamantyl cations in the gas phase,
J. Org. Chem. USSR, 1986, 22, 601. [all data]