Piperidine, 2,2,6,6-tetramethyl-
- Formula: C9H19N
- Molecular weight: 141.2539
- IUPAC Standard InChIKey: RKMGAJGJIURJSJ-UHFFFAOYSA-N
- CAS Registry Number: 768-66-1
- Chemical structure:
View 3d structure (requires JavaScript / HTML 5) - Other names: Norpempidine; 2,2,6,6-Tetramethylpiperidine

Gas phase thermochemistry data

Data compiled by: Hussein Y. Afeefy, Joel F. Liebman, and Stephen E. Stein
Quantity | Value | Units | Method | Reference | Comment |
---|---|---|---|---|---|
ΔfH°gas | -159.9 ± 2.8 | kJ/mol | Ccb | Suradi, Hacking, et al., 1981 |

Condensed phase thermochemistry data

Data compiled by: Hussein Y. Afeefy, Joel F. Liebman, and Stephen E. Stein
Quantity | Value | Units | Method | Reference | Comment |
---|---|---|---|---|---|
ΔfH°liquid | -206.9 ± 2.0 | kJ/mol | Ccb | Suradi, Hacking, et al., 1981 | |
Quantity | Value | Units | Method | Reference | Comment |
ΔcH°liquid | -6050.1 ± 1.5 | kJ/mol | Ccb | Suradi, Hacking, et al., 1981 |

Phase change data

Data compiled as indicated in comments:
BS - Robert L. Brown and Stephen E. Stein
ALS - Hussein Y. Afeefy, Joel F. Liebman, and Stephen E. Stein
DRB - Donald R. Burgess, Jr.
AC - William E. Acree, Jr., James S. Chickos
Quantity | Value | Units | Method | Reference | Comment |
---|---|---|---|---|---|
Tboil | 425.2 | K | N/A | Aldrich Chemical Company Inc., 1990 | BS |
Tboil | 429.2 | K | N/A | Weast and Grasselli, 1989 | BS |
Quantity | Value | Units | Method | Reference | Comment |
ΔvapH° | 47.0 ± 2.0 | kJ/mol | E | Suradi, Hacking, et al., 1981 | ALS |
ΔvapH° | 47.0 | kJ/mol | N/A | Suradi, Hacking, et al., 1981 | DRB |
Enthalpy of vaporization
ΔvapH (kJ/mol) | Temperature (K) | Reference | Comment |
---|---|---|---|
44.5 ± 0.5 | 300. | Verevkin, 1997 | Based on data from 288. to 313. K.; AC |

Reaction thermochemistry data

Data compiled by: John E. Bartmess
Individual Reactions
C9H18N- + =
By formula: C9H18N- + H+ = C9H19N
Quantity | Value | Units | Method | Reference | Comment |
---|---|---|---|---|---|
ΔrH° | 1630.5 ± 3.0 | kJ/mol | G+TS | Grimm and Bartmess, 1992 | gas phase |
Quantity | Value | Units | Method | Reference | Comment |
ΔrG° | 1599.5 ± 1.7 | kJ/mol | IMRE | Grimm and Bartmess, 1992 | gas phase |

Gas phase ion energetics data

Data evaluated as indicated in comments:
HL - Edward P. Hunter and Sharon G. Lias
Data compiled as indicated in comments:
B - John E. Bartmess
LBLHLM - Sharon G. Lias, John E. Bartmess, Joel F. Liebman, John L. Holmes, Rhoda D. Levin, and W. Gary Mallard
LLK - Sharon G. Lias, Rhoda D. Levin, and Sherif A. Kafafi
Quantity | Value | Units | Method | Reference | Comment |
---|---|---|---|---|---|
Proton affinity (review) | 987.0 | kJ/mol | N/A | Hunter and Lias, 1998 | HL |
Quantity | Value | Units | Method | Reference | Comment |
Gas basicity | 953.9 | kJ/mol | N/A | Hunter and Lias, 1998 | HL |
Ionization energy determinations
IE (eV) | Method | Reference | Comment |
---|---|---|---|
7.59 ± 0.05 | PE | Rozeboom and Houk, 1982 | LBLHLM |
7.39 | PE | Bodor, Kaminski, et al., 1974 | LLK |
8.14 | PE | Aue and Bowers, 1979 | Vertical value; LLK |
De-protonation reactions
C9H18N- + =
By formula: C9H18N- + H+ = C9H19N
Quantity | Value | Units | Method | Reference | Comment |
---|---|---|---|---|---|
ΔrH° | 1630.5 ± 3.0 | kJ/mol | G+TS | Grimm and Bartmess, 1992 | gas phase; B |
Quantity | Value | Units | Method | Reference | Comment |
ΔrG° | 1599.5 ± 1.7 | kJ/mol | IMRE | Grimm and Bartmess, 1992 | gas phase; B |

Normal alkane RI, non-polar column, custom temperature program

Column type | Active phase | I | Reference | Comment |
---|---|---|---|---|
Capillary | Methyl Silicone | 947. | Farkas, Héberger, et al., 2004 | Program: not specified |

References

Suradi, Hacking, et al., 1981
Suradi, S.; Hacking, J.M.; Pilcher, G.; Gumrukcu, I.; Lappert, M.F.,
Enthalpies of combustion of five sterically hindered amines,
J. Chem. Thermodyn., 1981, 13, 857-861. [all data]
Aldrich Chemical Company Inc., 1990
Aldrich Chemical Company Inc.,
Catalog Handbook of Fine Chemicals, Aldrich Chemical Company, Inc., Milwaukee WI, 1990, 1. [all data]
Weast and Grasselli, 1989
CRC Handbook of Data on Organic Compounds, 2nd Editon, Weast,R.C and Grasselli, J.G., ed(s)., CRC Press, Inc., Boca Raton, FL, 1989, 1. [all data]
Verevkin, 1997
Verevkin, Sergey P.,
Thermochemistry of amines: experimental standard molar enthalpies of formation of some aliphatic and aromatic amines,
The Journal of Chemical Thermodynamics, 1997, 29, 8, 891-899, https://doi.org/10.1006/jcht.1997.0212
. [all data]
Grimm and Bartmess, 1992
Grimm, D.T.; Bartmess, J.E.,
The Intrinsic (Gas Phase) Basicity of some Anions Commonly Used in Condensed-Phase Synthesis,
J. Am. Chem. Soc., 1992, 114, 4, 1227, https://doi.org/10.1021/ja00030a016
. [all data]
Hunter and Lias, 1998
Hunter, E.P.; Lias, S.G.,
Evaluated Gas Phase Basicities and Proton Affinities of Molecules: An Update,
J. Phys. Chem. Ref. Data, 1998, 27, 3, 413-656, https://doi.org/10.1063/1.556018
. [all data]
Rozeboom and Houk, 1982
Rozeboom, M.D.; Houk, K.N.,
Stereospecific alkyl group effects on amine lone-pair ionization potentials: Photoelectron spectra of alkylpiperidines,
J. Am. Chem. Soc., 1982, 104, 1189. [all data]
Bodor, Kaminski, et al., 1974
Bodor, N.; Kaminski, J.J.; Worley, S.D.; Colton, R.J.; Lee, T.H.; Rabalais, J.W.,
Photoelectron spectra, hydrolytic stability, and antimicrobial activity of N-chlorinated piperidines,
J. Pharm. Sci., 1974, 63, 1387. [all data]
Aue and Bowers, 1979
Aue, D.H.; Bowers, M.T.,
Chapter 9. Stabilities of positive ions from equilibrium gas phase basicity measurements
in Ions Chemistry,, ed. M.T. Bowers, 1979. [all data]
Farkas, Héberger, et al., 2004
Farkas, O.; Héberger, K.; Zenkevich, I.G.,
Quantitative structure-retention relationships. XIV. Prediction of gas chromatographic retention indices for saturated O-, N-, and S-heterocyclic compounds,
Chemom. Intell. Lab. Syst., 2004, 72, 2, 173-184, https://doi.org/10.1016/j.chemolab.2004.01.012
. [all data]