Benzene, 3-butenyl-
- Formula: C10H12
- Molecular weight: 132.2023
- IUPAC Standard InChIKey: PBGVMIDTGGTBFS-UHFFFAOYSA-N
- CAS Registry Number: 768-56-9
- Chemical structure:
View 3d structure (requires JavaScript / HTML 5) - Other names: 1-Butene, 4-phenyl-; 1-Phenyl-3-butene; 3-Butenylbenzene; 4-Phenyl-1-butene; 4-Phenylbut-1-ene; 4-Phenylbutene-1

Condensed phase thermochemistry data

Data compiled as indicated in comments:
DRB - Donald R. Burgess, Jr.
ALS - Hussein Y. Afeefy, Joel F. Liebman, and Stephen E. Stein
Quantity | Value | Units | Method | Reference | Comment |
---|---|---|---|---|---|
ΔfH°liquid | 33.4 ± 5.0 | kJ/mol | Ccb | N/A | recalculated with modern CO2,H2O thermo; estimated uncertainty (NOTE all values in source also have wrong sign); DRB |
ΔfH°liquid | 7.9 | kJ/mol | Ccb | Moureu and Andre, 1914 | ALS |
Quantity | Value | Units | Method | Reference | Comment |
ΔcH°liquid | -5683.5 | kJ/mol | Ccb | Moureu and Andre, 1914 | Corresponding ΔfHºliquid = 33. kJ/mol (simple calculation by NIST; no Washburn corrections); ALS |

Gas phase ion energetics data

Data compiled as indicated in comments:
LBLHLM - Sharon G. Lias, John E. Bartmess, Joel F. Liebman, John L. Holmes, Rhoda D. Levin, and W. Gary Mallard
LLK - Sharon G. Lias, Rhoda D. Levin, and Sherif A. Kafafi
Ionization energy determinations
IE (eV) | Method | Reference | Comment |
---|---|---|---|
8.60 | EI | Dass and Gross, 1985 | LBLHLM |
8.6 | PE | Fu and Dunbar, 1978 | LLK |
8.83 | PE | Fu and Dunbar, 1978 | Vertical value; LLK |

Phase change data

Data compiled as indicated in comments:
BS - Robert L. Brown and Stephen E. Stein
TRC - Thermodynamics Research Center, NIST Boulder Laboratories, Chris Muzny director
Quantity | Value | Units | Method | Reference | Comment |
---|---|---|---|---|---|
Tboil | 451. ± 5. | K | AVG | N/A | Average of 7 values; Individual data points |
Reduced pressure boiling point
Tboil (K) | Pressure (bar) | Reference | Comment |
---|---|---|---|
337.2 | 0.013 | Weast and Grasselli, 1989 | BS |

Normal alkane RI, non-polar column, custom temperature program

Data compiled by: NIST Mass Spectrometry Data Center, William E. Wallace, director

Column type Capillary
Active phase DB-1
Column length (m) 100.
Carrier gas
Substrate
Column diameter (mm) 0.25
Phase thickness (μm) 0.5
Program not specified
I 1022.
ReferenceHathcock and Bertsch, 1993
Comment MSDC-RI

Kovats' RI, non-polar column, isothermal

View large format table.

Column type Active phase Temperature (C) I Reference Comment
CapillaryOV-101100.1032.Engewald, Topalova, et al., 1987Column length: 50. m; Column diameter: 0.30 mm

References

Moureu and Andre, 1914
Moureu, C.; Andre, E.,
Thermochimie des composes acetyleniques,
Ann. Chim. Phys., 1914, 1, 113-145. [all data]
Dass and Gross, 1985
Dass, C.; Gross, M.L.,
The question of cyclic versus acyclic ions: The structure of [C6H10]+ gas phase ions,
Org. Mass Spectrom., 1985, 20, 34. [all data]
Fu and Dunbar, 1978
Fu, E.W.; Dunbar, R.C.,
Photodissociation spectroscopy and structural rearrangements in ions of cyclooctatetraene, styrene and related molecules,
J. Am. Chem. Soc., 1978, 100, 2283. [all data]