Benzenamine, N-(1-methylethyl)-
- Formula: C9H13N
- Molecular weight: 135.2062
- IUPAC Standard InChIKey: FRCFWPVMFJMNDP-UHFFFAOYSA-N
- CAS Registry Number: 768-52-5
- Chemical structure:
View 3d structure (requires JavaScript / HTML 5) - Other names: Aniline, N-isopropyl-; N-Isopropylaniline; N-Phenylisopropylamine; Phenylisopropylamine; Isopropylaniline; N-Isopropylbenzenamine; N-(1-Methylethyl)benzenamine; N-Isopropyl-N-phenylamine; N-(1-Methylethyl)phenylamine

Phase change data

Data compiled by: Robert L. Brown and Stephen E. Stein
Reduced pressure boiling point
Tboil (K) | Pressure (bar) | Reference |
---|---|---|
368. to 369. | 0.020 | Frinton Laboratories Inc., 1986 |

Gas phase ion energetics data

Data compiled by: Henry M. Rosenstock, Keith Draxl, Bruce W. Steiner, and John T. Herron
Ionization energy determinations
IE (eV) | Method | Reference |
---|---|---|
7.5 | CTS | Briegleb and Czekalla, 1959 |

Van Den Dool and Kratz RI, non-polar column, temperature ramp

Data compiled by: NIST Mass Spectrometry Data Center, William E. Wallace, director

Column type Capillary
Active phase OV-1
Column length (m)
Carrier gas
Substrate
Column diameter (mm)
Phase thickness (μm)
Tstart (C) 35.
Tend (C) 300.
Heat rate (K/min) 8.
Initial hold (min)
Final hold (min)
I 1127.2
ReferenceGautzsch and Zinn, 1996
Comment MSDC-RI

References

Frinton Laboratories Inc., 1986
Frinton Laboratories Inc.,
Catalog Number 11, Frinton Laboratories Inc., Vineland, NJ, 1986, 99. [all data]
Briegleb and Czekalla, 1959
Briegleb, G.; Czekalla, J.,
Die Bestimmung von lonisierungsenergien aus den Spektren von Elektronenubergangskomplexen,
Z.Elektrochem., 1959, 63, 6. [all data]