Silane, chlorodimethylphenyl-
- Formula: C8H11ClSi
- Molecular weight: 170.711
- IUPAC Standard InChIKey: KWYZNESIGBQHJK-UHFFFAOYSA-N
- CAS Registry Number: 768-33-2
- Chemical structure:
View 3d structure (requires JavaScript / HTML 5) - Other names: Phenyl dimethylchlorosilane; Chlorodimethylphenylsilane; Dimethylphenylchlorosilane; CP0160

Phase change data

Data compiled as indicated in comments:
BS - Robert L. Brown and Stephen E. Stein
AC - William E. Acree, Jr., James S. Chickos
Reduced pressure boiling point
Tboil (K) | Pressure (bar) | Reference | Comment |
---|---|---|---|
353. to 357. | 0.021 | PCR Inc., 1990 | BS |
Enthalpy of vaporization
ΔvapH (kJ/mol) | Temperature (K) | Reference | Comment |
---|---|---|---|
52.2 | 317. | Dykyj, Svoboda, et al., 1999 | Based on data from 302. to 467. K.; AC |
49.7 | 318. | Stull, 1947 | Based on data from 303. to 466. K.; AC |
Antoine Equation Parameters
log10(P) = A − (B / (T + C))
P = vapor pressure (bar)
T = temperature (K)
View plot Requires a JavaScript / HTML 5 canvas capable browser.
Temperature (K) | A | B | C | Reference | Comment |
---|---|---|---|---|---|
302.9 to 466.7 | 4.60314 | 1949.446 | -42.298 | Stull, 1947 | Coefficents calculated by NIST from author's data. |

Gas phase ion energetics data

Data compiled by: Sharon G. Lias, John E. Bartmess, Joel F. Liebman, John L. Holmes, Rhoda D. Levin, and W. Gary Mallard
Ionization energy determinations
IE (eV) | Method | Reference | Comment |
---|---|---|---|
9.3 | PE | Veszpremi, Harada, et al., 1984 | Vertical value |

Kovats' RI, non-polar column, isothermal

Column type | Active phase | Temperature (C) | I | Reference | Comment |
---|---|---|---|---|---|
Packed | Polymethylsiloxane, (PMS-20000) | 50. | 1099.3 | Ainshtein and Shulyatieva, 1972 | He, Chromosorb W; Column length: 2. m |

References

PCR Inc., 1990
PCR Inc.,
Research Chemicals Catalog 1990-1991, PCR Inc., Gainesville, FL, 1990, 1. [all data]
Dykyj, Svoboda, et al., 1999
Dykyj, J.; Svoboda, J.; Wilhoit, R.C.; Frenkel, M.L.; Hall, K.R.,
Vapor Pressure of Chemicals: Part A. Vapor Pressure and Antoine Constants for Hydrocarbons and Sulfur, Selenium, Tellurium and Hydrogen Containing Organic Compounds, Springer, Berlin, 1999, 373. [all data]
Stull, 1947
Stull, Daniel R.,
Vapor Pressure of Pure Substances. Organic and Inorganic Compounds,
Ind. Eng. Chem., 1947, 39, 4, 517-540, https://doi.org/10.1021/ie50448a022
. [all data]
Veszpremi, Harada, et al., 1984
Veszpremi, T.; Harada, Y.; Ohno, K.; Mutoh, H., Jr.,
Photoelectron and penning electron spectroscopic investigation of phenylhalosilanes,
J. Organomet. Chem., 1984, 266, 9. [all data]
Ainshtein and Shulyatieva, 1972
Ainshtein, A.A.; Shulyatieva, T.I.,
Retention indices of alkyl- and arylchlorosilanes,
Zh. Anal. Khim., 1972, 27, 816-821. [all data]