sodium fluoride
- Formula: FNa
- Molecular weight: 41.9881725
- IUPAC Standard InChIKey: PUZPDOWCWNUUKD-UHFFFAOYSA-M
- CAS Registry Number: 7681-49-4
- Chemical structure:
View 3d structure (requires JavaScript / HTML 5) - Permanent link for this species. Use this link for bookmarking this species for future reference.

Gas phase thermochemistry data

Quantity | Value | Units | Method | Reference | Comment |
---|---|---|---|---|---|
ΔfH°gas | -290.45 | kJ/mol | Review | Chase, 1998 | Data last reviewed in December, 1968 |
Quantity | Value | Units | Method | Reference | Comment |
S°gas,1 bar | 217.59 | J/mol*K | Review | Chase, 1998 | Data last reviewed in December, 1968 |
Gas Phase Heat Capacity (Shomate Equation)
Cp° = A + B*t + C*t2 + D*t3 +
E/t2
H° − H°298.15= A*t + B*t2/2 +
C*t3/3 + D*t4/4 − E/t + F − H
S° = A*ln(t) + B*t + C*t2/2 + D*t3/3 −
E/(2*t2) + G
Cp = heat capacity (J/mol*K)
H° = standard enthalpy (kJ/mol)
S° = standard entropy (J/mol*K)
t = temperature (K) / 1000.
View plot Requires a JavaScript / HTML 5 canvas capable browser.
Temperature (K) | 3500. to 6000. |
---|---|
A | 36.95560 |
B | 1.073858 |
C | -0.105601 |
D | 0.009001 |
E | -0.277921 |
F | -302.4505 |
G | 260.4368 |
H | -290.4533 |
Reference | Chase, 1998 |
Comment | Data last reviewed in December, 1968 |

Condensed phase thermochemistry data

Quantity | Value | Units | Method | Reference | Comment |
---|---|---|---|---|---|
ΔfH°liquid | -546.20 | kJ/mol | Review | Chase, 1998 | Data last reviewed in December, 1968 |
Quantity | Value | Units | Method | Reference | Comment |
S°liquid,1 bar | 73.46 | J/mol*K | Review | Chase, 1998 | Data last reviewed in December, 1968 |
Quantity | Value | Units | Method | Reference | Comment |
ΔfH°solid | -575.38 | kJ/mol | Review | Chase, 1998 | Data last reviewed in December, 1968 |
Quantity | Value | Units | Method | Reference | Comment |
S°solid | 51.21 | J/mol*K | Review | Chase, 1998 | Data last reviewed in December, 1968 |
Liquid Phase Heat Capacity (Shomate Equation)
Cp° = A + B*t + C*t2 + D*t3 +
E/t2
H° − H°298.15= A*t + B*t2/2 +
C*t3/3 + D*t4/4 − E/t + F − H
S° = A*ln(t) + B*t + C*t2/2 + D*t3/3 −
E/(2*t2) + G
Cp = heat capacity (J/mol*K)
H° = standard enthalpy (kJ/mol)
S° = standard entropy (J/mol*K)
t = temperature (K) / 1000.
View plot Requires a JavaScript / HTML 5 canvas capable browser.
Temperature (K) | 1269. to 3500. |
---|---|
A | 66.43350 |
B | -2.270481 |
C | 0.701306 |
D | -0.074194 |
E | 9.035070 |
F | -563.4560 |
G | 145.0370 |
H | -546.2040 |
Reference | Chase, 1998 |
Comment | Data last reviewed in December, 1968 |
Solid Phase Heat Capacity (Shomate Equation)
Cp° = A + B*t + C*t2 + D*t3 +
E/t2
H° − H°298.15= A*t + B*t2/2 +
C*t3/3 + D*t4/4 − E/t + F − H
S° = A*ln(t) + B*t + C*t2/2 + D*t3/3 −
E/(2*t2) + G
Cp = heat capacity (J/mol*K)
H° = standard enthalpy (kJ/mol)
S° = standard entropy (J/mol*K)
t = temperature (K) / 1000.
View plot Requires a JavaScript / HTML 5 canvas capable browser.
Temperature (K) | 298. to 1269. |
---|---|
A | 53.00220 |
B | -5.952150 |
C | 12.56350 |
D | 0.378227 |
E | -0.489113 |
F | -592.6740 |
G | 113.8140 |
H | -575.3840 |
Reference | Chase, 1998 |
Comment | Data last reviewed in December, 1968 |

Reaction thermochemistry data

Data compiled as indicated in comments:
ALS - Hussein Y. Afeefy, Joel F. Liebman, and Stephen E. Stein
B - John E. Bartmess
M - Michael M. Meot-Ner (Mautner) and Sharon G. Lias
Individual Reactions
By formula: 4Na + C2ClF3 = 2C + ClNa + 3FNa
Quantity | Value | Units | Method | Reference | Comment |
---|---|---|---|---|---|
ΔrH° | -1576.1 ± 5.4 | kJ/mol | Cm | Kolesov, Zenkov, et al., 1963 | gas phase; Reanalyzed by Cox and Pilcher, 1970, Original value = -1543. ± 5.4 kJ/mol; ALS |
By formula: 2HNaO + C2H3FO = C2H3NaO2 + FNa + H2O
Quantity | Value | Units | Method | Reference | Comment |
---|---|---|---|---|---|
ΔrH° | -56.15 ± 0.08 | kJ/mol | Cm | Pritchard and Skinner, 1950 | liquid phase; Corrected for CODATA value of ΔfH; HF(100); ALS |
ΔrH° | -177. | kJ/mol | Cm | Carson and Skinner, 1949 | liquid phase; ALS |
By formula: Be2F5- + FNa = (Be2F5- • FNa)
Quantity | Value | Units | Method | Reference | Comment |
---|---|---|---|---|---|
ΔrH° | 273. ± 10. | kJ/mol | N/A | Nikitin, Sorokin, et al., 1980 | gas phase; value altered from reference due to conversion from electron convention to ion convention; B |
By formula: C4F8 + 4Na = 4C + 8FNa
Quantity | Value | Units | Method | Reference | Comment |
---|---|---|---|---|---|
ΔrH° | -2989. ± 9.2 | kJ/mol | Ccb | Kolesov, Talakin, et al., 1968 | gas phase; Correction of Kolesov, Talakin, et al., 1964; ALS |
By formula: (F2Sc+ • 2FNa) + FNa = (F2Sc+ • 3FNa)
Quantity | Value | Units | Method | Reference | Comment |
---|---|---|---|---|---|
ΔrH° | 300. | kJ/mol | MS | Tsirlina, Gusarov, et al., 1986 | gas phase; Knudsen cell; M |
By formula: (F2Sc+ • 3FNa) + FNa = (F2Sc+ • 4FNa)
Quantity | Value | Units | Method | Reference | Comment |
---|---|---|---|---|---|
ΔrH° | 280. | kJ/mol | MS | Tsirlina, Gusarov, et al., 1986 | gas phase; Knudsen cell; M |
By formula: (Na+ • FNa) + FNa = (Na+ • 2FNa)
Quantity | Value | Units | Method | Reference | Comment |
---|---|---|---|---|---|
ΔrH° | 200. | kJ/mol | MS | Tsirlina, Gusarov, et al., 1986 | gas phase; Knudsen cell; M |
By formula: (F2Sc+ • FNa) + FNa = (F2Sc+ • 2FNa)
Quantity | Value | Units | Method | Reference | Comment |
---|---|---|---|---|---|
ΔrH° | 350. | kJ/mol | MS | Tsirlina, Gusarov, et al., 1986 | gas phase; Knudsen cell; M |
By formula: Na+ + FNa = (Na+ • FNa)
Quantity | Value | Units | Method | Reference | Comment |
---|---|---|---|---|---|
ΔrH° | 262. | kJ/mol | MS | Tsirlina, Gusarov, et al., 1986 | gas phase; Knudsen cell; M |
By formula: 4Na + CF4 = C + 4FNa
Quantity | Value | Units | Method | Reference | Comment |
---|---|---|---|---|---|
ΔrH° | -1362. ± 9.2 | kJ/mol | Ccb | Vorob'ev and Skuratov, 1960 | gas phase; ALS |
By formula: C2F4 + 4Na = 4FNa + 2C
Quantity | Value | Units | Method | Reference | Comment |
---|---|---|---|---|---|
ΔrH° | -1611. ± 4.6 | kJ/mol | Cm | Kolesov, Zenkov, et al., 1962 | gas phase; ALS |
By formula: 8Na + C3F8 = 3C + 8FNa
Quantity | Value | Units | Method | Reference | Comment |
---|---|---|---|---|---|
ΔrH° | -2761. ± 7.1 | kJ/mol | Ccb | Kolesov, Talakin, et al., 1967 | gas phase; ALS |

Gas phase ion energetics data

Data compiled as indicated in comments:
LLK - Sharon G. Lias, Rhoda D. Levin, and Sherif A. Kafafi
RDSH - Henry M. Rosenstock, Keith Draxl, Bruce W. Steiner, and John T. Herron
B - John E. Bartmess
Electron affinity determinations
EA (eV) | Method | Reference | Comment |
---|---|---|---|
0.520 ± 0.010 | LPES | Miller, Leopold, et al., 1986 | B |
1.10 ± 0.20 | LPES | Miller and Lineberger, 1990 | Vertical Detachment Energy: 1.5±0.1 eV; B |
0.41998 | NBAE | De Vreugd, Wijnaendts van Resandt, et al., 1979 | B |
1.12 ± 0.21 | EIAE | Shevchenko, Iljin, et al., 1976 | From Na2BO2F; B |
>1.34997 | EIAE | Ebinghaus, 1964 | From (NaF)2; B |
Appearance energy determinations
Ion | AE (eV) | Other Products | Method | Reference | Comment |
---|---|---|---|---|---|
Na+ | 9.98 ± 0.15 | F | EI | Shevchenko, Iljin, et al., 1976 | LLK |
Na+ | 9.9 ± 0.2 | F | EI | Hastie, Zmbov, et al., 1968 | RDSH |
Na+ | ~12. | F | EI | Porter and Schoonmaker, 1958 | RDSH |

Ion clustering data

Data compiled as indicated in comments:
B - John E. Bartmess
M - Michael M. Meot-Ner (Mautner) and Sharon G. Lias
Clustering reactions
By formula: Be2F5- + FNa = (Be2F5- • FNa)
Quantity | Value | Units | Method | Reference | Comment |
---|---|---|---|---|---|
ΔrH° | 65.2 ± 2.5 | kcal/mol | N/A | Nikitin, Sorokin, et al., 1980 | gas phase; value altered from reference due to conversion from electron convention to ion convention; B |
By formula: (F2Sc+ • FNa) + FNa = (F2Sc+ • 2FNa)
Quantity | Value | Units | Method | Reference | Comment |
---|---|---|---|---|---|
ΔrH° | 83. | kcal/mol | MS | Tsirlina, Gusarov, et al., 1986 | gas phase; Knudsen cell; M |
By formula: (F2Sc+ • 2FNa) + FNa = (F2Sc+ • 3FNa)
Quantity | Value | Units | Method | Reference | Comment |
---|---|---|---|---|---|
ΔrH° | 72. | kcal/mol | MS | Tsirlina, Gusarov, et al., 1986 | gas phase; Knudsen cell; M |
By formula: (F2Sc+ • 3FNa) + FNa = (F2Sc+ • 4FNa)
Quantity | Value | Units | Method | Reference | Comment |
---|---|---|---|---|---|
ΔrH° | 67. | kcal/mol | MS | Tsirlina, Gusarov, et al., 1986 | gas phase; Knudsen cell; M |
By formula: Na+ + FNa = (Na+ • FNa)
Quantity | Value | Units | Method | Reference | Comment |
---|---|---|---|---|---|
ΔrH° | 62.7 | kcal/mol | MS | Tsirlina, Gusarov, et al., 1986 | gas phase; Knudsen cell; M |
By formula: (Na+ • FNa) + FNa = (Na+ • 2FNa)
Quantity | Value | Units | Method | Reference | Comment |
---|---|---|---|---|---|
ΔrH° | 47. | kcal/mol | MS | Tsirlina, Gusarov, et al., 1986 | gas phase; Knudsen cell; M |

Constants of diatomic molecules

Data compiled by: Klaus P. Huber and Gerhard H. Herzberg
Data collected through March, 1977
Symbol | Meaning |
---|---|
State | electronic state and / or symmetry symbol |
Te | minimum electronic energy (cm-1) |
ωe | vibrational constant – first term (cm-1) |
ωexe | vibrational constant – second term (cm-1) |
ωeye | vibrational constant – third term (cm-1) |
Be | rotational constant in equilibrium position (cm-1) |
αe | rotational constant – first term (cm-1) |
γe | rotation-vibration interaction constant (cm-1) |
De | centrifugal distortion constant (cm-1) |
βe | rotational constant – first term, centrifugal force (cm-1) |
re | internuclear distance (Å) |
Trans. | observed transition(s) corresponding to electronic state |
ν00 | position of 0-0 band (units noted in table) |
State | Te | ωe | ωexe | ωeye | Be | αe | γe | De | βe | re | Trans. | ν00 |
---|---|---|---|---|---|---|---|---|---|---|---|---|
The electron energy loss spectrum has peaks at 5.7, 7.7, (18.5), 32.5 eV. | ||||||||||||
↳Geiger and Pfeiffer, 1968 | ||||||||||||
Continuous absorption above 41000 cm-1. | ||||||||||||
↳Muller, 1927 | ||||||||||||
A 1 | A ← X | |||||||||||
↳Barrow and Caunt, 1953 | ||||||||||||
X 1Σ+ | 0 | 536 2 3 (Z) | 3.4 2 | 0.43690127 | 0.00455869 | 2.335E-5 | 1.161E-6 | 1.925947 4 | ||||
↳Ritchie and Lew, 1964; Baikov and Vasilevskii, 1967 | ||||||||||||
Rotation sp. | ||||||||||||
↳Bauer and Lew, 1963; Hollowell, Hebert, et al., 1964; Veazey and Gordy, 1965 | ||||||||||||
Mol. beam rf electric 5 | ||||||||||||
↳Hollowell, Hebert, et al., 1964; Graff and Werth, 1965 | ||||||||||||
and magnetic reson. | ||||||||||||
↳Zeiger and Bolef, 1952; Logan, Cote, et al., 1952; Cote and Kusch, 1953 |

References

Chase, 1998
Chase, M.W., Jr.,
NIST-JANAF Themochemical Tables, Fourth Edition,
J. Phys. Chem. Ref. Data, Monograph 9, 1998, 1-1951. [all data]
Kolesov, Zenkov, et al., 1963
Kolesov, V.P.; Zenkov, I.D.; Skuratov, S.M.,
Standard enthalpy of formation of chlorotrifluoroethylene,
Russ. J. Phys. Chem. (Engl. Transl.), 1963, 37, 115-116. [all data]
Cox and Pilcher, 1970
Cox, J.D.; Pilcher, G.,
Thermochemistry of Organic and Organometallic Compounds, Academic Press, New York, 1970, 1-636. [all data]
Pritchard and Skinner, 1950
Pritchard, H.O.; Skinner, H.A.,
The heat of hydrolysis of acetyl fluoride,
J. Chem. Soc., 1950, 1099. [all data]
Carson and Skinner, 1949
Carson, A.S.; Skinner, H.A.,
201. Carbon-halogen bond energies in the acetyl halides,
J. Chem. Soc., 1949, 936-939. [all data]
Nikitin, Sorokin, et al., 1980
Nikitin, M.I.; Sorokin, I.D.; Skokan, E.V.; Sidorov, L.N.,
Negative Ions in the Saturated Vapors of the Potassium Fluoride - Hafnium Tetrafluoride and Potassium Fluoride - Beryllium Difluoride Systems,
Russ. J. Phys. Chem., 1980, 54, page]. [all data]
Kolesov, Talakin, et al., 1968
Kolesov, V.P.; Talakin, O.G.; Skuratov, S.M.,
Enthalpy of formation of some specimens of amorphous carbon,
Russ. J. Phys. Chem. (Engl. Transl.), 1968, 42, 1218-1220. [all data]
Kolesov, Talakin, et al., 1964
Kolesov, V.P.; Talakin, O.G.; Skuratov, S.M.,
Standard enthalpy of formation of perfluorocyclobutane,
Russ. J. Phys. Chem. (Engl. Transl.), 1964, 38, 930-931. [all data]
Tsirlina, Gusarov, et al., 1986
Tsirlina, E.A.; Gusarov, A.V.; Gorokhov, L.N.,
High Temp., 1986, 14, 1064. [all data]
Vorob'ev and Skuratov, 1960
Vorob'ev, A.F.; Skuratov, S.M.,
Standard enthalpies of formation of CF4,
Zh. Neorg. Khim., 1960, 5, 1398-1401. [all data]
Kolesov, Zenkov, et al., 1962
Kolesov, V.P.; Zenkov, I.D.; Skuratov, S.M.,
The standard enthalpy of formation of tetrafluoroethylene,
Russ. J. Phys. Chem. (Engl. Transl.), 1962, 36, 45-47. [all data]
Kolesov, Talakin, et al., 1967
Kolesov, V.P.; Talakin, O.G.; Skuratov, S.M.,
Standard enthalpy of formation of perfluoropropane and enthalpies of formation of normal perfluoroalkanes,
Vestn. Mosk. Univ. Khim., 1967, 22, 38-42. [all data]
Miller, Leopold, et al., 1986
Miller, T.M.; Leopold, D.G.; Murray, K.K.; Lineberger, W.C.,
Electron Affinities of the Alkali Halides and the Structure of their Negative Ions,
J. Chem. Phys., 1986, 85, 5, 2368, https://doi.org/10.1063/1.451091
. [all data]
Miller and Lineberger, 1990
Miller, T.M.; Lineberger, W.C.,
Mass Spectra and Photodetachment of Sodium Fluoride Negative Ion Clusters,
Int. J. Mass Spectrom. Ion Proc., 1990, 102, 239, https://doi.org/10.1016/0168-1176(90)80063-9
. [all data]
De Vreugd, Wijnaendts van Resandt, et al., 1979
De Vreugd, C.; Wijnaendts van Resandt, R.W.; Los, J.; Smith, B.,
Differential Cross Sections for Collisions of Negative Halogen Ions and Alkali Atoms,
Chem. Phys., 1979, 42, 3, 305, https://doi.org/10.1016/0301-0104(79)80078-6
. [all data]
Shevchenko, Iljin, et al., 1976
Shevchenko, V.E.; Iljin, M.K.; Nikitin, O.T.; Sidorov, L.N.,
Mass-spectrometric study of mixed dimers M2BO2F,
Int. J. Mass Spectrom. Ion Phys., 1976, 21, 279. [all data]
Ebinghaus, 1964
Ebinghaus, H.Z.,
Negative Ionen aus Alkalihalogeniden und Electronenaffinitaten der Alkalimetalle und Alkalihalogenide,
Z. Naturfor., 1964, 19A, 727. [all data]
Hastie, Zmbov, et al., 1968
Hastie, J.W.; Zmbov, K.F.; Margrave, J.L.,
Mass spectrometric studies at high temperatures. XXIII. Vapor equilibria over molten NaSnF3 and KSnF3,
J. Inorg. Nucl. Chem., 1968, 30, 729. [all data]
Porter and Schoonmaker, 1958
Porter, R.F.; Schoonmaker, R.C.,
Mass spectrometric study of the vaporization of LiF, NaF, and LiF-NaF mixtures,
J. Chem. Phys., 1958, 29, 1070. [all data]