potassium iodide
- Formula: IK
- Molecular weight: 166.0028
- IUPAC Standard InChIKey: NLKNQRATVPKPDG-UHFFFAOYSA-M
- CAS Registry Number: 7681-11-0
- Chemical structure:

Condensed phase thermochemistry data

Quantity | Value | Units | Method | Reference | Comment |
---|---|---|---|---|---|
ΔfH°liquid | -312.85 | kJ/mol | Review | Chase, 1998 | Data last reviewed in June, 1967 |
Quantity | Value | Units | Method | Reference | Comment |
S°liquid,1 bar | 114.10 | J/mol*K | Review | Chase, 1998 | Data last reviewed in June, 1967 |
Quantity | Value | Units | Method | Reference | Comment |
ΔfH°solid | -327.90 | kJ/mol | Review | Chase, 1998 | Data last reviewed in June, 1967 |
Quantity | Value | Units | Method | Reference | Comment |
S°solid | 106.37 | J/mol*K | Review | Chase, 1998 | Data last reviewed in June, 1967 |
Liquid Phase Heat Capacity (Shomate Equation)
Cp° = A + B*t + C*t2 + D*t3 +
E/t2
H° − H°298.15= A*t + B*t2/2 +
C*t3/3 + D*t4/4 − E/t + F − H
S° = A*ln(t) + B*t + C*t2/2 + D*t3/3 −
E/(2*t2) + G
Cp = heat capacity (J/mol*K)
H° = standard enthalpy (kJ/mol)
S° = standard entropy (J/mol*K)
t = temperature (K) / 1000.
View plot Requires a JavaScript / HTML 5 canvas capable browser.
Temperature (K) | 954. to 2500. |
---|---|
A | 72.38320 |
B | -1.627693×10-9 |
C | 1.020901×10-9 |
D | -2.026337×10-10 |
E | -4.120467×10-11 |
F | -334.4271 |
G | 201.6935 |
H | -312.8465 |
Reference | Chase, 1998 |
Comment | Data last reviewed in June, 1967 |
Solid Phase Heat Capacity (Shomate Equation)
Cp° = A + B*t + C*t2 + D*t3 +
E/t2
H° − H°298.15= A*t + B*t2/2 +
C*t3/3 + D*t4/4 − E/t + F − H
S° = A*ln(t) + B*t + C*t2/2 + D*t3/3 −
E/(2*t2) + G
Cp = heat capacity (J/mol*K)
H° = standard enthalpy (kJ/mol)
S° = standard entropy (J/mol*K)
t = temperature (K) / 1000.
View plot Requires a JavaScript / HTML 5 canvas capable browser.
Temperature (K) | 298. to 954. |
---|---|
A | 73.62376 |
B | -85.43644 |
C | 130.0973 |
D | -48.86619 |
E | -0.502415 |
F | -348.7987 |
G | 212.7614 |
H | -327.9005 |
Reference | Chase, 1998 |
Comment | Data last reviewed in June, 1967 |

Phase change data

Antoine Equation Parameters
log10(P) = A − (B / (T + C))
P = vapor pressure (bar)
T = temperature (K)
View plot Requires a JavaScript / HTML 5 canvas capable browser.
Temperature (K) | A | B | C | Reference | Comment |
---|---|---|---|---|---|
1018. to 1597. | 4.40221 | 6421.797 | -136.338 | Stull, 1947 | Coefficents calculated by NIST from author's data. |

Reaction thermochemistry data

Data compiled by: John E. Bartmess
Individual Reactions
By formula: I- + IK = (I- • IK)
Quantity | Value | Units | Method | Reference | Comment |
---|---|---|---|---|---|
ΔrH° | 163. ± 8.8 | kJ/mol | N/A | Burdukovskaya, Kudin, et al., 1984 | gas phase; value altered from reference due to conversion from electron convention to ion convention |

Gas phase ion energetics data

Data compiled as indicated in comments:
LBLHLM - Sharon G. Lias, John E. Bartmess, Joel F. Liebman, John L. Holmes, Rhoda D. Levin, and W. Gary Mallard
LLK - Sharon G. Lias, Rhoda D. Levin, and Sherif A. Kafafi
RDSH - Henry M. Rosenstock, Keith Draxl, Bruce W. Steiner, and John T. Herron
B - John E. Bartmess
Electron affinity determinations
EA (eV) | Method | Reference | Comment |
---|---|---|---|
0.728 ± 0.010 | LPES | Miller, Leopold, et al., 1986 | B |
0.50 ± 0.10 | LPES | Yang, Bloomfield, et al., 1992 | EA given is Vertical Detachment Energy. Adiabatic EA est as up to 1 eV smaller; B |
Ionization energy determinations
IE (eV) | Method | Reference | Comment |
---|---|---|---|
7.5 ± 0.4 | EI | Emons, Horlbeck, et al., 1982 | LBLHLM |
7.2 ± 0.1 | PE | Potts and Price, 1977 | LLK |
7.2 ± 0.1 | PE | Potts, Williams, et al., 1974 | LLK |
8.2 ± 0.3 | EI | Platel, 1965 | RDSH |
7.4 | PE | Goodman, Allen, et al., 1974 | Vertical value; LLK |
Appearance energy determinations
Ion | AE (eV) | Other Products | Method | Reference | Comment |
---|---|---|---|---|---|
I+ | 14.6 ± 0.3 | K | EI | Platel, 1965 | RDSH |
K+ | 8.6 ± 0.3 | I | EI | Platel, 1965 | RDSH |
K+ | 25.14 ± 0.04 | I(-) | PE | Potts and Price, 1977 | Vertical value; LLK |

Ion clustering data

Data compiled by: John E. Bartmess
Clustering reactions
By formula: I- + IK = (I- • IK)
Quantity | Value | Units | Method | Reference | Comment |
---|---|---|---|---|---|
ΔrH° | 163. ± 8.8 | kJ/mol | N/A | Burdukovskaya, Kudin, et al., 1984 | gas phase; value altered from reference due to conversion from electron convention to ion convention |

Gas phase thermochemistry data

Quantity Value Units Method Reference Comment
Δfgas-125.52kJ/molReviewChase, 1998Data last reviewed in June, 1967
Quantity Value Units Method Reference Comment
gas,1 bar258.28J/mol*KReviewChase, 1998Data last reviewed in June, 1967

Gas Phase Heat Capacity (Shomate Equation)

Cp° = A + B*t + C*t2 + D*t3 + E/t2
H° − H°298.15= A*t + B*t2/2 + C*t3/3 + D*t4/4 − E/t + F − H
S° = A*ln(t) + B*t + C*t2/2 + D*t3/3 − E/(2*t2) + G
    Cp = heat capacity (J/mol*K)
    H° = standard enthalpy (kJ/mol)
    S° = standard entropy (J/mol*K)
    t = temperature (K) / 1000.

View plot Requires a JavaScript / HTML 5 canvas capable browser.

View table.

Temperature (K) 2500. - 6000.
A 37.40622
B 0.828440
C -0.002031
D 0.000174
E -0.047344
F -136.8683
G 303.0375
H -125.5200
ReferenceChase, 1998
Comment Data last reviewed in June, 1967

Constants of diatomic molecules

Data compiled by: Klaus P. Huber and Gerhard H. Herzberg

Data collected through January, 1977

Symbols used in the table of constants
SymbolMeaning
State electronic state and / or symmetry symbol
Te minimum electronic energy (cm-1)
ωe vibrational constant – first term (cm-1)
ωexe vibrational constant – second term (cm-1)
ωeye vibrational constant – third term (cm-1)
Be rotational constant in equilibrium position (cm-1)
αe rotational constant – first term (cm-1)
γe rotation-vibration interaction constant (cm-1)
De centrifugal distortion constant (cm-1)
βe rotational constant – first term, centrifugal force (cm-1)
re internuclear distance (Å)
Trans. observed transition(s) corresponding to electronic state
ν00 position of 0-0 band (units noted in table)
Diatomic constants for 39K127I
StateTeωeωexeωeyeBeαeγeDeβereTrans.ν00
Features in the elctron energy loss spectrum Geiger and Pfeiffer, 1968, Rudge, Trajmar, et al., 1976 at ~3.8, 4.7, 5.1 eV correspond to maxima in the absorption spectrum. Peaks at higher energies could indicate that KI absorbs strongly in the VUV region; structure above 19 eV may arise from excitation of a metal 3p electron.
Continuous absorption 1 above 26500 cm-1, maxima at 30800, 38400, 41700 2 cm-1.
Muller, 1927; Levi, 1934; Davidovits and Brodhead, 1967
A (0+) (26620) 3
X 1Σ+ 0 186.53 4 0.574  0.06087473 0.00026776 3.88E-7 2.5934E-8 4E-12 3.047844 5
Honig, Mandel, et al., 1954; Rusk and Gordy, 1962

References

Chase, 1998
Chase, M.W., Jr.,
NIST-JANAF Themochemical Tables, Fourth Edition,
J. Phys. Chem. Ref. Data, Monograph 9, 1998, 1-1951. [all data]
Stull, 1947
Stull, Daniel R.,
Vapor Pressure of Pure Substances. Organic and Inorganic Compounds,
Ind. Eng. Chem., 1947, 39, 4, 517-540, https://doi.org/10.1021/ie50448a022
. [all data]
Burdukovskaya, Kudin, et al., 1984
Burdukovskaya, G.G.; Kudin, L.S.; Butman, M.F.; Krasnov, K.S.,
Ionic forms in the vapour over potassium iodide,
Russ. J. Inorg. Chem., 1984, 29, 3020. [all data]
Miller, Leopold, et al., 1986
Miller, T.M.; Leopold, D.G.; Murray, K.K.; Lineberger, W.C.,
Electron Affinities of the Alkali Halides and the Structure of their Negative Ions,
J. Chem. Phys., 1986, 85, 5, 2368, https://doi.org/10.1063/1.451091
. [all data]
Yang, Bloomfield, et al., 1992
Yang, Y.A.; Bloomfield, L.A.; Jin, C.; Wang, L.S.; Smalley, R.E.,
Ultraviolet Photoelectron Spectroscopy and Photofragmentation Studies of Excess Electrons in Potassium Iodide Cluster Anions,
J. Chem. Phys., 1992, 96, 4, 2453, https://doi.org/10.1063/1.462049
. [all data]
Emons, Horlbeck, et al., 1982
Emons, H.-H.; Horlbeck, W.; Kiessling, D.,
Massenspektrometrische untersuchung der gasphase uber alkalimetalliodiden,
Z. Anorg. Allg. Chem., 1982, 488, 212. [all data]
Potts and Price, 1977
Potts, A.W.; Price, W.C.,
Photoelectron studies of ionic materials using molecular beam techniques,
Phys. Scr., 1977, 16, 191. [all data]
Potts, Williams, et al., 1974
Potts, A.W.; Williams, T.A.; Price, W.C.,
Photoelectron spectra and electronic structure of diatomic alkali halides,
Proc. Roy. Soc. London A, 1974, 341, 147. [all data]
Platel, 1965
Platel, G.,
Mesures des potentials d'apparition des ions obtenus par impact electronique dans la phase vapeur des iodures alcalins et des melanges LiI-MI,
J. Chim. Phys., 1965, 62, 1176. [all data]
Goodman, Allen, et al., 1974
Goodman, T.D.; Allen, J.D., Jr.; Cusachs, L.C.; Schweitzer, G.K.,
The photoelectron spectra of gaseous alkali halides,
J. Electron Spectrosc. Relat. Phenom., 1974, 3, 289. [all data]