Cobalt, methylidene-
- Formula: CH2Co
- Molecular weight: 72.9598
- IUPAC Standard InChIKey: BMWBSEDTCDPYCU-UHFFFAOYSA-N
- CAS Registry Number: 76792-07-9
- Chemical structure:
View 3d structure (requires JavaScript / HTML 5) - Permanent link for this species. Use this link for bookmarking this species for future reference.

Gas phase ion energetics data

Data compiled by: Sharon G. Lias, John E. Bartmess, Joel F. Liebman, John L. Holmes, Rhoda D. Levin, and W. Gary Mallard
Appearance energy determinations
Ion | AE (eV) | Other Products | Method | Reference | Comment |
---|---|---|---|---|---|
CCo+ | 3.1 ± 0.2 | H2 | PI | Hettich and Freiser, 1986 | |
CHCo+ | 3.6 ± 0.2 | H | PI | Hettich and Freiser, 1986 | |
Co+ | 3.6 ± 0.2 | CH2 | PI | Hettich and Freiser, 1986 |

References

Hettich and Freiser, 1986
Hettich, R.L.; Freiser, B.S.,
Gas-phase photodissociation of FeCH2+ and CoCH2+: Determination of the carbide, carbyne, and carbene bond energies,
J. Am. Chem. Soc., 1986, 108, 2537. [all data]