1H-Indene, 3-methyl-
- Formula: C10H10
- Molecular weight: 130.1864
- IUPAC Standard InChIKey: COOKKJGOGWACMY-UHFFFAOYSA-N
- CAS Registry Number: 767-60-2
- Chemical structure:
View 3d structure (requires JavaScript / HTML 5) - Other names: Indene, 3-methyl-; 3-Methylindene; 3-Methyl-1H-indene; 1-Methyl-3H-indene

Gas phase ion energetics data

Data compiled as indicated in comments:
LBLHLM - Sharon G. Lias, John E. Bartmess, Joel F. Liebman, John L. Holmes, Rhoda D. Levin, and W. Gary Mallard
Ionization energy determinations
IE (eV) | Method | Reference | Comment |
---|---|---|---|
7.97 | PI | Domnin, Lakshin, et al., 1985 | LBLHLM |
8.05 | EI | Dass and Gross, 1983 | LBLHLM |
Appearance energy determinations
Ion | AE (eV) | Other Products | Method | Reference | Comment |
---|---|---|---|---|---|
C9H7+ | 11.65 | CH3 | PI | Domnin, Lakshin, et al., 1985 | LBLHLM |

References

Domnin, Lakshin, et al., 1985
Domnin, I.N.; Lakshin, A.M.; Misharev, A.D.; Orlov, V.M.; Takhistov, V.V.,
Thermochemical investigation of some hydrocarbon ions generated by photoionization,
J. Org. Chem. USSR, 1985, 21, 1149. [all data]
Dass and Gross, 1983
Dass, C.; Gross, M.L.,
Electrocyclic ring opening of 1-phenylcyclobutene and 3-phenylcyclobutene radical cations,
J. Am. Chem. Soc., 1983, 105, 5724. [all data]