Benzonitrile, 3-chloro-
- Formula: C7H4ClN
- Molecular weight: 137.566
- IUPAC Standard InChIKey: WBUOVKBZJOIOAE-UHFFFAOYSA-N
- CAS Registry Number: 766-84-7
- Chemical structure:
View 3d structure (requires JavaScript / HTML 5) - Other names: Benzonitrile, m-chloro-; m-Chlorobenzonitrile; m-Cyanochlorobenzene; 3-Chlorobenzonitrile; 3-Chlorobenzoic acid nitrile

Gas phase ion energetics data

Data compiled by: Henry M. Rosenstock, Keith Draxl, Bruce W. Steiner, and John T. Herron
Ionization energy determinations
IE (eV) | Method | Reference |
---|---|---|
9.93 ± 0.04 | EI | Buchs, 1970 |
Appearance energy determinations
Ion | AE (eV) | Other Products | Method | Reference | Comment |
---|---|---|---|---|---|
C7H4N+ | 13.8 ± 0.1 | Cl | EI | Brown, 1970 |

References

Buchs, 1970
Buchs, A.,
Etude par spectrometrie de masse de l'ionisation de benzonitriles, de phenylacetonitriles et de N,N-dimethylanilines substitues,
Helv. Chim. Acta, 1970, 53, 2026. [all data]
Brown, 1970
Brown, P.,
Kinetic studies in mass spectrometry-IV. The [M - Cl] reaction in substituted chlorobenzenes and the question of molecular ion isomerization,
Org. Mass Spectrom., 1970, 3, 639. [all data]