Benzene, 1-chloro-2-methoxy-
- Formula: C7H7ClO
- Molecular weight: 142.583
- IUPAC Standard InChIKey: QGRPVMLBTFGQDQ-UHFFFAOYSA-N
- CAS Registry Number: 766-51-8
- Chemical structure:
View 3d structure (requires JavaScript / HTML 5) - Other names: Anisole, o-chloro-; o-Chloroanisole; o-Chloromethoxybenzene; o-Chlorophenyl methyl ether; 1-Chloro-2-methoxybenzene; 2-Chloroanisole; 2-Chlorophenol methyl ether; ortho-Chloroanisole; NSC 155175

Phase change data

Data compiled as indicated in comments:
BS - Robert L. Brown and Stephen E. Stein
TRC - Thermodynamics Research Center, NIST Boulder Laboratories, Chris Muzny director
AC - William E. Acree, Jr., James S. Chickos
Quantity | Value | Units | Method | Reference | Comment |
---|---|---|---|---|---|
Tboil | 468.7 | K | N/A | Aldrich Chemical Company Inc., 1990 | BS |
Quantity | Value | Units | Method | Reference | Comment |
Tfus | 246.59 | K | N/A | Dreisbach and Martin, 1949 | Uncertainty assigned by TRC = 0.05 K; TRC |
Quantity | Value | Units | Method | Reference | Comment |
ΔvapH° | 55.0 ± 0.8 | kJ/mol | C | Ribeiro da Silva and Ferreira, 2008 | AC |
Enthalpy of vaporization
ΔvapH (kJ/mol) | Temperature (K) | Method | Reference | Comment |
---|---|---|---|---|
48.3 | 403. | A | Stephenson and Malanowski, 1987 | Based on data from 388. to 460. K. See also Kkykj and Repas, 1973 and Dykyj, Svoboda, et al., 1999.; AC |
Antoine Equation Parameters
log10(P) = A − (B / (T + C))
P = vapor pressure (bar)
T = temperature (K)
View plot Requires a JavaScript / HTML 5 canvas capable browser.
Temperature (K) | A | B | C | Reference | Comment |
---|---|---|---|---|---|
388.28 to 459.34 | 4.29246 | 1687.613 | -81.12 | Dreisbach and Shrader, 1949 | Coefficents calculated by NIST from author's data. |

Gas phase ion energetics data

Data compiled as indicated in comments:
LBLHLM - Sharon G. Lias, John E. Bartmess, Joel F. Liebman, John L. Holmes, Rhoda D. Levin, and W. Gary Mallard
RDSH - Henry M. Rosenstock, Keith Draxl, Bruce W. Steiner, and John T. Herron
Ionization energy determinations
IE (eV) | Method | Reference | Comment |
---|---|---|---|
8.42 | EI | Russell, Freiser, et al., 1983 | LBLHLM |
8.3 ± 0.15 | CTS | Voigt and Reid, 1964 | RDSH |
Appearance energy determinations
Ion | AE (eV) | Other Products | Method | Reference | Comment |
---|---|---|---|---|---|
C6H7+ | 9.88 | ? | EI | Russell, Freiser, et al., 1983 | LBLHLM |
C7H7O+ | 10.37 | Cl | EI | Russell, Freiser, et al., 1983 | LBLHLM |

Kovats' RI, non-polar column, isothermal

Column type | Active phase | Temperature (C) | I | Reference | Comment |
---|---|---|---|---|---|
Capillary | SE-30 | 140. | 1097. | Korhonen, 1984 | N2; Column length: 25. m; Column diameter: 0.3 mm |
Capillary | SE-30 | 160. | 1099. | Korhonen, 1984 | N2; Column length: 25. m; Column diameter: 0.3 mm |
Capillary | SE-30 | 180. | 1108. | Korhonen, 1984 | N2; Column length: 25. m; Column diameter: 0.3 mm |

Kovats' RI, non-polar column, custom temperature program

Column type | Active phase | I | Reference | Comment |
---|---|---|---|---|
Packed | Apiezon M | 1135.6 | Jalali-Heravi and Garkani-Nejad, 1993 | Chromosorb W; Column length: 2. m; Program: not specified |

Kovats' RI, polar column, isothermal

Column type | Active phase | Temperature (C) | I | Reference | Comment |
---|---|---|---|---|---|
Capillary | OV-351 | 140. | 1689. | Korhonen, 1984 | N2; Column length: 25. m; Column diameter: 0.32 mm |
Capillary | OV-351 | 160. | 1690. | Korhonen, 1984 | N2; Column length: 25. m; Column diameter: 0.32 mm |
Capillary | OV-351 | 180. | 1684. | Korhonen, 1984 | N2; Column length: 25. m; Column diameter: 0.32 mm |

Van Den Dool and Kratz RI, non-polar column, temperature ramp

Column type | Active phase | I | Reference | Comment |
---|---|---|---|---|
Capillary | OV-1 | 1092.6 | Gautzsch and Zinn, 1996 | 8. K/min; Tstart: 35. C; Tend: 300. C |
Capillary | SE-30 | 1102. | Korhonen, 1984 | N2, 10. K/min; Column length: 25. m; Column diameter: 0.3 mm; Tstart: 100. C |
Capillary | SE-30 | 1093. | Korhonen, 1984 | N2, 2. K/min; Column length: 25. m; Column diameter: 0.3 mm; Tstart: 100. C |
Capillary | SE-30 | 1099. | Korhonen, 1984 | N2, 6. K/min; Column length: 25. m; Column diameter: 0.3 mm; Tstart: 100. C |

Van Den Dool and Kratz RI, polar column, temperature ramp

Column type | Active phase | I | Reference | Comment |
---|---|---|---|---|
Capillary | OV-351 | 1674. | Korhonen, 1984 | N2, 10. K/min; Column length: 25. m; Column diameter: 0.32 mm; Tstart: 100. C |
Capillary | OV-351 | 1650. | Korhonen, 1984 | N2, 2. K/min; Column length: 25. m; Column diameter: 0.32 mm; Tstart: 100. C |
Capillary | OV-351 | 1657. | Korhonen, 1984 | N2, 6. K/min; Column length: 25. m; Column diameter: 0.32 mm; Tstart: 100. C |

Normal alkane RI, non-polar column, temperature ramp

Column type | Active phase | I | Reference | Comment |
---|---|---|---|---|
Capillary | Ultra-1 | 1089. | Okumura, 1991 | 25. m/0.32 mm/0.25 μm, He, 3. K/min; Tstart: 80. C; Tend: 260. C |

References

Aldrich Chemical Company Inc., 1990
Aldrich Chemical Company Inc.,
Catalog Handbook of Fine Chemicals, Aldrich Chemical Company, Inc., Milwaukee WI, 1990, 1. [all data]
Dreisbach and Martin, 1949
Dreisbach, R.R.; Martin, R.A.,
Physical Data on Some Organic Compounds,
Ind. Eng. Chem., 1949, 41, 2875-8. [all data]
Ribeiro da Silva and Ferreira, 2008
Ribeiro da Silva, Manuel A.V.; Ferreira, Ana I.M.C. Lobo,
Standard molar enthalpies of formation of the three isomers of chloroanisole,
The Journal of Chemical Thermodynamics, 2008, 40, 3, 362-368, https://doi.org/10.1016/j.jct.2007.10.001
. [all data]
Stephenson and Malanowski, 1987
Stephenson, Richard M.; Malanowski, Stanislaw,
Handbook of the Thermodynamics of Organic Compounds, 1987, https://doi.org/10.1007/978-94-009-3173-2
. [all data]
Kkykj and Repas, 1973
Kkykj, J.; Repas, M.,
Petrochemia, 1973, 13, 179. [all data]
Dykyj, Svoboda, et al., 1999
Dykyj, J.; Svoboda, J.; Wilhoit, R.C.; Frenkel, M.L.; Hall, K.R.,
Vapor Pressure of Chemicals: Part A. Vapor Pressure and Antoine Constants for Hydrocarbons and Sulfur, Selenium, Tellurium and Hydrogen Containing Organic Compounds, Springer, Berlin, 1999, 373. [all data]
Dreisbach and Shrader, 1949
Dreisbach, R.R.; Shrader, S.A.,
Vapor Pressure--Temperature Data on Some Organic Compounds,
Ind. Eng. Chem., 1949, 41, 12, 2879-2880, https://doi.org/10.1021/ie50480a054
. [all data]
Russell, Freiser, et al., 1983
Russell, D.H.; Freiser, B.S.; McBay, E.H.; Canada, D.C.,
The structure of decomposing [C7H7O]+ ions: Benzyl versus tropylium ion structures,
Org. Mass Spectrom., 1983, 18, 474. [all data]
Voigt and Reid, 1964
Voigt, E.M.; Reid, C.,
Ionization potentials of substituted benzenes and their charge-transfer spectra with tetracyanoethylene,
J. Am. Chem. Soc., 1964, 86, 3930. [all data]
Korhonen, 1984
Korhonen, I.O.O.,
Gas-Liquid Chromatographic Analyses. XXVIII. Capillary Column Studies of Chlorinated Anisoles,
J. Chromatogr., 1984, 294, 99-116, https://doi.org/10.1016/S0021-9673(01)96118-7
. [all data]
Jalali-Heravi and Garkani-Nejad, 1993
Jalali-Heravi, M.; Garkani-Nejad, Z.,
Prediction of gas chromatographic retention indices of some benzene derivatives,
J. Chromatogr., 1993, 648, 2, 389-393, https://doi.org/10.1016/0021-9673(93)80421-4
. [all data]
Gautzsch and Zinn, 1996
Gautzsch, R.; Zinn, P.,
Use of incremental models to estimate the retention indexes of aromatic compounds,
Chromatographia, 1996, 43, 3/4, 163-176, https://doi.org/10.1007/BF02292946
. [all data]
Okumura, 1991
Okumura, T.,
retention indices of environmental chemicals on methyl silicone capillary column,
Journal of Environmental Chemistry (Japan), 1991, 1, 2, 333-358, https://doi.org/10.5985/jec.1.333
. [all data]