2-Methylphenylacetylene
- Formula: C9H8
- Molecular weight: 116.1598
- IUPAC Standard InChIKey: MYBSUWNEMXUTAX-UHFFFAOYSA-N
- CAS Registry Number: 766-47-2
- Chemical structure:
View 3d structure (requires JavaScript / HTML 5) - Other names: Benzene,1-ethynyl-2-methyl-

Gas phase ion energetics data

Data compiled as indicated in comments:
LLK - Sharon G. Lias, Rhoda D. Levin, and Sherif A. Kafafi
RDSH - Henry M. Rosenstock, Keith Draxl, Bruce W. Steiner, and John T. Herron
Ionization energy determinations
IE (eV) | Method | Reference | Comment |
---|---|---|---|
8.90 | EI | Occolowitz and White, 1968 | RDSH |
8.61 ± 0.02 | PE | Carlier and Mouvier, 1979 | Vertical value; LLK |
Appearance energy determinations
Ion | AE (eV) | Other Products | Method | Reference | Comment |
---|---|---|---|---|---|
C9H7+ | 11.36 | H | EI | Occolowitz and White, 1968 | RDSH |

References

Occolowitz and White, 1968
Occolowitz, J.L.; White, G.L.,
Energetic considerations in the assignment of some fragment ion structures,
Australian J. Chem., 1968, 21, 997. [all data]
Carlier and Mouvier, 1979
Carlier, P.; Mouvier, G.,
Etude par spectrometrie de photoelectrons de la structure electronique des phenyl-alcynes conjugues,
J. Electron Spectrosc. Relat. Phenom., 1979, 16, 169-181. [all data]