Spiro[4.4]nona-1,3-diene
- Formula: C9H12
- Molecular weight: 120.1916
- IUPAC Standard InChIKey: FHTXZDURQDIVCD-UHFFFAOYSA-N
- CAS Registry Number: 766-29-0
- Chemical structure:
View 3d structure (requires JavaScript / HTML 5) - Species with the same structure:

Gas phase ion energetics data

Data compiled as indicated in comments:
LLK - Sharon G. Lias, Rhoda D. Levin, and Sherif A. Kafafi
Ionization energy determinations
IE (eV) | Method | Reference | Comment |
---|---|---|---|
8.14 | PE | Bischof, Gleiter, et al., 1974 | LLK |
8.10 | PE | Batich, Heilbronner, et al., 1974 | Vertical value; LLK |

References

Bischof, Gleiter, et al., 1974
Bischof, P.; Gleiter, R.; de Meijere, A.; Meyer, L.-U.,
The conjugative interaction between π-orbitals and cyclobutane-orbitals in spiro[3.4]octa-5,7-diene and spiro[3.4]octene-5,
Helv. Chim. Acta, 1974, 57, 1519. [all data]
Batich, Heilbronner, et al., 1974
Batich, C.; Heilbronner, E.; Rommel, E.; Semmelhack, M.F.; Foos, J.S.,
Equivalence of the energy gaps {DELTA}I(1,2) and {DELTA}E(1,2) between corresponding bands in the photoelectron (I) and electronic absorption (E) spectra of spiro[4.4]nonatetraene. An amusing consequence of spiroconjugation,
J. Am. Chem. Soc., 1974, 96, 7662. [all data]