Cyclopentane, (1-methylethylidene)-
- Formula: C8H14
- Molecular weight: 110.1968
- IUPAC Standard InChIKey: RIYRLXGSAJWZRO-UHFFFAOYSA-N
- CAS Registry Number: 765-83-3
- Chemical structure:
View 3d structure (requires JavaScript / HTML 5) - Permanent link for this species. Use this link for bookmarking this species for future reference.

Phase change data

Data compiled by: Thermodynamics Research Center, NIST Boulder Laboratories, Chris Muzny director
Quantity | Value | Units | Method | Reference | Comment |
---|---|---|---|---|---|
Tboil | 409.4 | K | N/A | Gold, 1970 | Uncertainty assigned by TRC = 1. K |
Tboil | 408. | K | N/A | Chiurdoglu, Laune, et al., 1956 | Uncertainty assigned by TRC = 4. K |

Reaction thermochemistry data

Data compiled by: Hussein Y. Afeefy, Joel F. Liebman, and Stephen E. Stein
Individual Reactions
By formula: C8H14 = C8H14
Quantity | Value | Units | Method | Reference | Comment |
---|---|---|---|---|---|
ΔrH° | 4.3 ± 0.3 | kJ/mol | Kin | Bigley and May, 1970 | liquid phase; solvent: Acetic acid |

Gas phase ion energetics data

Data compiled by: Sharon G. Lias, John E. Bartmess, Joel F. Liebman, John L. Holmes, Rhoda D. Levin, and W. Gary Mallard
Ionization energy determinations
IE (eV) | Method | Reference | Comment |
---|---|---|---|
8.34 ± 0.02 | PE | Brown, Buschek, et al., 1983 | Vertical value |

References

Gold, 1970
Gold, P.I.,
The Kinetics of Acid-catalysed Equilibrations of Endo- and Exo-cyclic Olefins,
J. Chem. Soc. B, 1970, 1970, 1761-6. [all data]
Chiurdoglu, Laune, et al., 1956
Chiurdoglu, G.; Laune, J.; Poelmans, M.,
Acyclic compounds with Quarternary Carbon IV. Conjugation with 1-Ethoxycaronylcycloprpanesprirocyclanes,
Bull Soc. Chim. Belges, 1956, 65, 257-69. [all data]
Bigley and May, 1970
Bigley, D.B.; May, R.W.,
The kinetics of acid-catalysed equilibrations of endo- and exo-cyclic olefins,
J. Chem. Soc. B, 1970, 1761-1766. [all data]
Brown, Buschek, et al., 1983
Brown, R.S.; Buschek, J.M.; Kopecky, K.R.; Miller, A.J.,
Photoelectron spectra of syn- and anti-sesquinorbornene. Evidence for vertical Σ-π delocalization in bicyclo[2.2.1]heptene,
J. Org. Chem., 1983, 48, 3692. [all data]