Spiro[2,4]hepta-4,6-diene
- Formula: C7H8
- Molecular weight: 92.1384
- IUPAC Standard InChIKey: KPDOKSJMJMDRQA-UHFFFAOYSA-N
- CAS Registry Number: 765-46-8
- Chemical structure:
View 3d structure (requires JavaScript / HTML 5) - Other names: Spiro[2.4]hepta-4,6-diene

Gas phase thermochemistry data

Data compiled by: Hussein Y. Afeefy, Joel F. Liebman, and Stephen E. Stein
Quantity | Value | Units | Method | Reference | Comment |
---|---|---|---|---|---|
ΔfH°gas | 238. | kJ/mol | Chyd | Roth, Adamczak, et al., 1991 |

Phase change data

Data compiled by: Robert L. Brown and Stephen E. Stein
Reduced pressure boiling point
Tboil (K) | Pressure (bar) | Reference |
---|---|---|
330.2 | 0.133 | Aldrich Chemical Company Inc., 1990 |

Reaction thermochemistry data

Data compiled by: Hussein Y. Afeefy, Joel F. Liebman, and Stephen E. Stein
Individual Reactions
By formula: 3H2 + C7H8 = C7H14
Quantity | Value | Units | Method | Reference | Comment |
---|---|---|---|---|---|
ΔrH° | -364. ± 0.8 | kJ/mol | Chyd | Roth, Adamczak, et al., 1991 | liquid phase |

Gas phase ion energetics data

Data compiled as indicated in comments:
LLK - Sharon G. Lias, Rhoda D. Levin, and Sherif A. Kafafi
RDSH - Henry M. Rosenstock, Keith Draxl, Bruce W. Steiner, and John T. Herron
Ionization energy determinations
IE (eV) | Method | Reference | Comment |
---|---|---|---|
8.14 | PE | Gleiter, Heilbronner, et al., 1971 | LLK |
Appearance energy determinations
Ion | AE (eV) | Other Products | Method | Reference | Comment |
---|---|---|---|---|---|
C7H7+ | 10.5 ± 0.1 | H | EI | Meyer, Haynes, et al., 1965 | RDSH |

References

Roth, Adamczak, et al., 1991
Roth, W.R.; Adamczak, O.; Breuckmann, R.; Lennartz, H.-W.; Boese, R.,
Die Berechnung von Resonanzenergien; das MM2ERW-Kraftfeld,
Chem. Ber., 1991, 124, 2499-2521. [all data]
Aldrich Chemical Company Inc., 1990
Aldrich Chemical Company Inc.,
Catalog Handbook of Fine Chemicals, Aldrich Chemical Company, Inc., Milwaukee WI, 1990, 1. [all data]
Gleiter, Heilbronner, et al., 1971
Gleiter, R.; Heilbronner, E.; de Meijere, A.,
Die konjugative Wechselwirkung zwischen π-und Walsh-Orbitalen: das Photoelektron-Spektrum des Homofulvens,
Helv. Chim. Acta, 1971, 54, 1029. [all data]
Meyer, Haynes, et al., 1965
Meyer, F.; Haynes, P.; McLean, S.; Harrison, A.G.,
An electron impact study of some C8H10 isomers,
Can. J. Chem., 1965, 43, 211. [all data]