Ethanone, 1-cyclopropyl-
- Formula: C5H8O
- Molecular weight: 84.1164
- IUPAC Standard InChIKey: HVCFCNAITDHQFX-UHFFFAOYSA-N
- CAS Registry Number: 765-43-5
- Chemical structure:
View 3d structure (requires JavaScript / HTML 5) - Other names: Ketone, cyclopropyl methyl; Acetylcyclopropane; Cyclopropyl methyl ketone; Methyl cyclopropyl ketone; 1-Cyclopropylethanone; NSC 1940

Gas phase thermochemistry data

Data compiled by: Hussein Y. Afeefy, Joel F. Liebman, and Stephen E. Stein
Quantity | Value | Units | Method | Reference | Comment |
---|---|---|---|---|---|
ΔfH°gas | -115.3 ± 1.2 | kJ/mol | Ccb | Kozina, Timofeeva, et al., 1984 |

Condensed phase thermochemistry data

Data compiled by: Hussein Y. Afeefy, Joel F. Liebman, and Stephen E. Stein
Quantity | Value | Units | Method | Reference | Comment |
---|---|---|---|---|---|
ΔfH°liquid | -154.7 ± 1.2 | kJ/mol | Ccb | Kozina, Timofeeva, et al., 1984 | |
Quantity | Value | Units | Method | Reference | Comment |
ΔcH°liquid | -2956.2 ± 1.0 | kJ/mol | Ccb | Kozina, Timofeeva, et al., 1984 | Corresponding ΔfHºliquid = -154.7 kJ/mol (simple calculation by NIST; no Washburn corrections) |
ΔcH°liquid | -2916. | kJ/mol | Ccb | Zubova, 1901 | Corresponding ΔfHºliquid = -195. kJ/mol (simple calculation by NIST; no Washburn corrections) |

Phase change data

Data compiled as indicated in comments:
BS - Robert L. Brown and Stephen E. Stein
TRC - Thermodynamics Research Center, NIST Boulder Laboratories, Chris Muzny director
ALS - Hussein Y. Afeefy, Joel F. Liebman, and Stephen E. Stein
AC - William E. Acree, Jr., James S. Chickos
Quantity | Value | Units | Method | Reference | Comment |
---|---|---|---|---|---|
Tboil | 387.2 | K | N/A | Aldrich Chemical Company Inc., 1990 | BS |
Tboil | 384.4 | K | N/A | Majer and Svoboda, 1985 | |
Tboil | 387. | K | N/A | Buckingham and Donaghy, 1982 | BS |
Tboil | 384. | K | N/A | Hammond and Todd, 1954 | Uncertainty assigned by TRC = 3. K; TRC |
Tboil | 384.35 | K | N/A | Van Volkenburgh, Greenlee, et al., 1949 | Uncertainty assigned by TRC = 0.5 K; TRC |
Quantity | Value | Units | Method | Reference | Comment |
Tfus | 204.85 | K | N/A | Van Volkenburgh, Greenlee, et al., 1949 | Uncertainty assigned by TRC = 0.3 K; TRC |
Quantity | Value | Units | Method | Reference | Comment |
ΔvapH° | 39.47 | kJ/mol | N/A | Majer and Svoboda, 1985 | |
ΔvapH° | 39.41 ± 0.09 | kJ/mol | C | Fuchs and Hallman, 1983 | ALS |
ΔvapH° | 39.4 ± 0.1 | kJ/mol | C | Fuchs and Hallman, 1983 | AC |
Enthalpy of vaporization
ΔvapH (kJ/mol) | Temperature (K) | Method | Reference | Comment |
---|---|---|---|---|
34.07 | 384.4 | N/A | Majer and Svoboda, 1985 | |
37.6 | 374. | A | Stephenson and Malanowski, 1987 | Based on data from 361. to 387. K.; AC |

Reaction thermochemistry data

Data compiled as indicated in comments:
B - John E. Bartmess
M - Michael M. Meot-Ner (Mautner) and Sharon G. Lias
ALS - Hussein Y. Afeefy, Joel F. Liebman, and Stephen E. Stein
Individual Reactions
C5H7O- + =
By formula: C5H7O- + H+ = C5H8O
Quantity | Value | Units | Method | Reference | Comment |
---|---|---|---|---|---|
ΔrH° | 1530. ± 17. | kJ/mol | G+TS | Brickhouse and Squires, 1988 | gas phase; Between MeCHO, Me2C=NOH; B |
Quantity | Value | Units | Method | Reference | Comment |
ΔrG° | 1502. ± 17. | kJ/mol | IMRB | Brickhouse and Squires, 1988 | gas phase; Between MeCHO, Me2C=NOH; B |
By formula: C5H9O+ + C5H8O = (C5H9O+ • C5H8O)
Bond type: Hydrogen bonds of the type OH-O between organics
Quantity | Value | Units | Method | Reference | Comment |
---|---|---|---|---|---|
ΔrH° | 113. | kJ/mol | PHPMS | Szulejko and McMahon, 1991 | gas phase; M |
Quantity | Value | Units | Method | Reference | Comment |
ΔrS° | 123. | J/mol*K | PHPMS | Szulejko and McMahon, 1991 | gas phase; M |
By formula: C5H8O = C5H8O
Quantity | Value | Units | Method | Reference | Comment |
---|---|---|---|---|---|
ΔrH° | -9.6 ± 3.3 | kJ/mol | Eqk | Cocks and Egger, 1973 | gas phase; ALS |

Gas phase ion energetics data

Data evaluated as indicated in comments:
HL - Edward P. Hunter and Sharon G. Lias
Data compiled as indicated in comments:
B - John E. Bartmess
LLK - Sharon G. Lias, Rhoda D. Levin, and Sherif A. Kafafi
Quantity | Value | Units | Method | Reference | Comment |
---|---|---|---|---|---|
Proton affinity (review) | 854.9 | kJ/mol | N/A | Hunter and Lias, 1998 | HL |
Quantity | Value | Units | Method | Reference | Comment |
Gas basicity | 823. | kJ/mol | N/A | Hunter and Lias, 1998 | HL |
Ionization energy determinations
IE (eV) | Method | Reference | Comment |
---|---|---|---|
9.46 | PE | Al-Khafaji and Shanshal, 1977 | Vertical value; LLK |
9.50 | PE | Kelder, Cerfontain, et al., 1974 | Vertical value; LLK |
De-protonation reactions
C5H7O- + =
By formula: C5H7O- + H+ = C5H8O
Quantity | Value | Units | Method | Reference | Comment |
---|---|---|---|---|---|
ΔrH° | 1530. ± 17. | kJ/mol | G+TS | Brickhouse and Squires, 1988 | gas phase; Between MeCHO, Me2C=NOH; B |
Quantity | Value | Units | Method | Reference | Comment |
ΔrG° | 1502. ± 17. | kJ/mol | IMRB | Brickhouse and Squires, 1988 | gas phase; Between MeCHO, Me2C=NOH; B |

Ion clustering data

Data compiled by: Michael M. Meot-Ner (Mautner) and Sharon G. Lias
Clustering reactions
By formula: C5H9O+ + C5H8O = (C5H9O+ • C5H8O)
Bond type: Hydrogen bonds of the type OH-O between organics
Quantity | Value | Units | Method | Reference | Comment |
---|---|---|---|---|---|
ΔrH° | 113. | kJ/mol | PHPMS | Szulejko and McMahon, 1991 | gas phase |
Quantity | Value | Units | Method | Reference | Comment |
ΔrS° | 123. | J/mol*K | PHPMS | Szulejko and McMahon, 1991 | gas phase |

Normal alkane RI, non-polar column, custom temperature program

Column type | Active phase | I | Reference | Comment |
---|---|---|---|---|
Capillary | SPB-1 | 704. | Flanagan, Streete, et al., 1997 | 60. m/0.53 mm/5. μm, He; Program: 40C(6min) => 5C/min => 80C => 10C/min => 200C |
Capillary | Polydimethyl siloxanes | 706. | Zenkevich and Chupalov, 1996 | Program: not specified |
Capillary | SPB-1 | 704. | Strete, Ruprah, et al., 1992 | 60. m/0.53 mm/5.0 μm, Helium; Program: 40 0C (6 min) 5 0C/min -> 80 0C 10 0C/min -> 200 0C |
Capillary | SPB-1 | 730. | Strete, Ruprah, et al., 1992 | 60. m/0.53 mm/5.0 μm, Helium; Program: not specified |
Capillary | OV-1 | 730. | Ramsey and Flanagan, 1982 | Program: not specified |

References

Kozina, Timofeeva, et al., 1984
Kozina, M.P.; Timofeeva, L.P.; Gal'chenko, G.L.; Balenkova, E.S.; Ordubadi, M.D.,
Enthalpies of combustion and formation of 1-methylnorcamphor and methylcyclopropyl ketone,
Moscow Univ. Chem. Bull. (Engl. Transl.), 1984, 25, 41-45. [all data]
Zubova, 1901
Zubova, P.,
Data about heat of combustion of compound cycle structure,
Zh. Fiz. Khim., 1901, 33, 708-722. [all data]
Aldrich Chemical Company Inc., 1990
Aldrich Chemical Company Inc.,
Catalog Handbook of Fine Chemicals, Aldrich Chemical Company, Inc., Milwaukee WI, 1990, 1. [all data]
Majer and Svoboda, 1985
Majer, V.; Svoboda, V.,
Enthalpies of Vaporization of Organic Compounds: A Critical Review and Data Compilation, Blackwell Scientific Publications, Oxford, 1985, 300. [all data]
Buckingham and Donaghy, 1982
Buckingham, J.; Donaghy, S.M.,
Dictionary of Organic Compounds: Fifth Edition, Chapman and Hall, New York, 1982, 1. [all data]
Hammond and Todd, 1954
Hammond, G.S.; Todd, R.W.,
The Low Reactivity of Cyclopropane Derivatives twoard Free Radicals,
J. Am. Chem. Soc., 1954, 76, 4081. [all data]
Van Volkenburgh, Greenlee, et al., 1949
Van Volkenburgh, R.; Greenlee, K.W.; Derfer, J.M.; Boord, C.E.,
The Synthesis of Some Cyclopropane Hydrocarbons From Methyl Cyclopropyl Ketone,
J. Am. Chem. Soc., 1949, 71, 172-5. [all data]
Fuchs and Hallman, 1983
Fuchs, R.; Hallman, J.H.,
Heats of vaporization of some monosubstituted cyclopropane, cyclobutane, and cyclopentane derivatives. Some observations on the enthalpies of isodesmic ring opening reactions of cyclobutane derivatives,
Can. J. Chem., 1983, 61, 503-505. [all data]
Stephenson and Malanowski, 1987
Stephenson, Richard M.; Malanowski, Stanislaw,
Handbook of the Thermodynamics of Organic Compounds, 1987, https://doi.org/10.1007/978-94-009-3173-2
. [all data]
Brickhouse and Squires, 1988
Brickhouse, M.D.; Squires, R.R.,
Gas Phase Bronsted vs. Lewis Acid-Base Reactions of 6,6-Dimethylfulvene. A Sensitive Probe of the Electronic Structures of Organic Anions,
J. Am. Chem. Soc., 1988, 110, 9, 2706, https://doi.org/10.1021/ja00217a002
. [all data]
Szulejko and McMahon, 1991
Szulejko, J.E.; McMahon, T.B.,
A Pulsed Electron Beam, Variable Temperature, High Pressure Mass Spectrometric Reevaluation of the Proton Affinity Difference Between 2-Methylpropene and Ammonia,
Int. J. Mass Spectrom. Ion Proc., 1991, 109, 279, https://doi.org/10.1016/0168-1176(91)85109-Y
. [all data]
Cocks and Egger, 1973
Cocks, A.T.; Egger, K.W.,
Gas-phase thermal unimolecular isomerizations of acetylcyclopropane. Part I. The equilibrium between 2,3-dihydro-5-methylfuran and acetylcyclopropane,
J. Chem. Soc. Perkin Trans. 2, 1973, 197-199. [all data]
Hunter and Lias, 1998
Hunter, E.P.; Lias, S.G.,
Evaluated Gas Phase Basicities and Proton Affinities of Molecules: An Update,
J. Phys. Chem. Ref. Data, 1998, 27, 3, 413-656, https://doi.org/10.1063/1.556018
. [all data]
Al-Khafaji and Shanshal, 1977
Al-Khafaji, J.A.; Shanshal, M.,
The photoelectron spectra of cyclopropyl ketones,
Z. Naturforsch. A:, 1977, 32, 109. [all data]
Kelder, Cerfontain, et al., 1974
Kelder, J.; Cerfontain, H.; Higginson, B.R.; Lloyd, D.R.,
Photoelectron and ultraviolet absorption spectra of cyclopropyl conjugated 1,2-diketones,
Tetrahedron Lett., 1974, 739. [all data]
Flanagan, Streete, et al., 1997
Flanagan, R.J.; Streete, P.J.; Ramsey, J.D.,
Volatile Substance Abuse, UNODC Technical Series, No 5, United Nations, Office on Drugs and Crime, Vienna International Centre, PO Box 500, A-1400 Vienna, Austria, 1997, 56, retrieved from http://www.odccp.org/pdf/technicalseries1997-01-011.pdf. [all data]
Zenkevich and Chupalov, 1996
Zenkevich, I.G.; Chupalov, A.A.,
New Possibilities of Chromato Mass Pectrometric Identification of Organic Compounds Using Increments of Gas Chromatographic Retention Indices of Molecular Structural Fragments,
Zh. Org. Khim. (Rus.), 1996, 32, 5, 656-666. [all data]
Strete, Ruprah, et al., 1992
Strete, P.J.; Ruprah, M.; Ramsey, J.D.; Flanagan, R.J.,
Detection and identification of volatile substances by headspace capillary gas chromatography to aid the diagnosis of acute poisoning,
Analyst, 1992, 117, 7, 1111-1127, https://doi.org/10.1039/an9921701111
. [all data]
Ramsey and Flanagan, 1982
Ramsey, J.D.; Flanagan, R.J.,
Detection and Identification of Volatile Organic Compounds in Blood by Headspace Gas Chromatography as an Aid to the Diagnosis of Solvent Abuse,
J. Chromatogr., 1982, 240, 2, 423-444, https://doi.org/10.1016/S0021-9673(00)99622-5
. [all data]