N,N-Dichloromethylamine
- Formula: CH3Cl2N
- Molecular weight: 99.947
- IUPAC Standard InChIKey: DWEYPOWXNBAIDU-UHFFFAOYSA-N
- CAS Registry Number: 7651-91-4
- Chemical structure:
View 3d structure (requires JavaScript / HTML 5) - Permanent link for this species. Use this link for bookmarking this species for future reference.

Gas phase ion energetics data

Data compiled as indicated in comments:
LBLHLM - Sharon G. Lias, John E. Bartmess, Joel F. Liebman, John L. Holmes, Rhoda D. Levin, and W. Gary Mallard
LLK - Sharon G. Lias, Rhoda D. Levin, and Sherif A. Kafafi
Ionization energy determinations
IE (eV) | Method | Reference | Comment |
---|---|---|---|
9.52 | PE | Molder, Pikver, et al., 1983 | LBLHLM |
9.35 ± 0.02 | PE | Colbourne, Frost, et al., 1978 | LLK |
10.06 ± 0.10 | PE | Nagy-Felsobuki and Peel, 1978 | Vertical value; LLK |

References

Molder, Pikver, et al., 1983
Molder, U.H.; Pikver, R.J.; Koppel, I.A.,
Photoelectron spectra of molecules. 4. Amines,
Org. React. Tartu, 1983, 20, 355. [all data]
Colbourne, Frost, et al., 1978
Colbourne, D.; Frost, D.C.; McDowell, C.A.; Westwood, N.P.C.,
The photoelectron spectra of the chloramines NH2Cl, NHCl2, NCl3 and the methyl chloramines CH3NHCl, CH3NCl2, and (CH3)2NCl,
J. Chem. Phys., 1978, 69, 1078. [all data]
Nagy-Felsobuki and Peel, 1978
Nagy-Felsobuki, E.; Peel, J.B.,
Photoelectron spectra of methylchloramine and methyldichloramine,
J. Chem. Soc. Faraday Trans. 2, 1978, 74, 1927. [all data]