sodium bromide
- Formula: BrNa
- Molecular weight: 102.894
- IUPAC Standard InChIKey: JHJLBTNAGRQEKS-UHFFFAOYSA-M
- CAS Registry Number: 7647-15-6
- Chemical structure:
View 3d structure (requires JavaScript / HTML 5) - Permanent link for this species. Use this link for bookmarking this species for future reference.

Gas phase thermochemistry data

Quantity | Value | Units | Method | Reference | Comment |
---|---|---|---|---|---|
ΔfH°gas | -143.93 | kJ/mol | Review | Chase, 1998 | Data last reviewed in September, 1964 |
Quantity | Value | Units | Method | Reference | Comment |
S°gas,1 bar | 241.22 | J/mol*K | Review | Chase, 1998 | Data last reviewed in September, 1964 |
Gas Phase Heat Capacity (Shomate Equation)
Cp° = A + B*t + C*t2 + D*t3 +
E/t2
H° − H°298.15= A*t + B*t2/2 +
C*t3/3 + D*t4/4 − E/t + F − H
S° = A*ln(t) + B*t + C*t2/2 + D*t3/3 −
E/(2*t2) + G
Cp = heat capacity (J/mol*K)
H° = standard enthalpy (kJ/mol)
S° = standard entropy (J/mol*K)
t = temperature (K) / 1000.
View plot Requires a JavaScript / HTML 5 canvas capable browser.
Temperature (K) | 2500. to 6000. |
---|---|
A | 37.35684 |
B | 0.829323 |
C | -0.013582 |
D | 0.001162 |
E | -0.114704 |
F | -155.4896 |
G | 285.5316 |
H | -143.9300 |
Reference | Chase, 1998 |
Comment | Data last reviewed in September, 1964 |

Condensed phase thermochemistry data

Quantity | Value | Units | Method | Reference | Comment |
---|---|---|---|---|---|
ΔfH°liquid | -339.34 | kJ/mol | Review | Chase, 1998 | Data last reviewed in September, 1964 |
Quantity | Value | Units | Method | Reference | Comment |
S°liquid,1 bar | 104.36 | J/mol*K | Review | Chase, 1998 | Data last reviewed in September, 1964 |
Quantity | Value | Units | Method | Reference | Comment |
ΔfH°solid | -361.41 | kJ/mol | Review | Chase, 1998 | Data last reviewed in September, 1964 |
Quantity | Value | Units | Method | Reference | Comment |
S°solid | 86.83 | J/mol*K | Review | Chase, 1998 | Data last reviewed in September, 1964 |
Liquid Phase Heat Capacity (Shomate Equation)
Cp° = A + B*t + C*t2 + D*t3 +
E/t2
H° − H°298.15= A*t + B*t2/2 +
C*t3/3 + D*t4/4 − E/t + F − H
S° = A*ln(t) + B*t + C*t2/2 + D*t3/3 −
E/(2*t2) + G
Cp = heat capacity (J/mol*K)
H° = standard enthalpy (kJ/mol)
S° = standard entropy (J/mol*K)
t = temperature (K) / 1000.
View plot Requires a JavaScript / HTML 5 canvas capable browser.
Temperature (K) | 1020. to 2500. |
---|---|
A | 62.34202 |
B | -8.511470×10-10 |
C | 5.852203×10-10 |
D | -1.246246×10-10 |
E | -1.695457×10-11 |
F | -357.9312 |
G | 179.8066 |
H | -339.3433 |
Reference | Chase, 1998 |
Comment | Data last reviewed in September, 1964 |
Solid Phase Heat Capacity (Shomate Equation)
Cp° = A + B*t + C*t2 + D*t3 +
E/t2
H° − H°298.15= A*t + B*t2/2 +
C*t3/3 + D*t4/4 − E/t + F − H
S° = A*ln(t) + B*t + C*t2/2 + D*t3/3 −
E/(2*t2) + G
Cp = heat capacity (J/mol*K)
H° = standard enthalpy (kJ/mol)
S° = standard entropy (J/mol*K)
t = temperature (K) / 1000.
View plot Requires a JavaScript / HTML 5 canvas capable browser.
Temperature (K) | 298. to 1020. |
---|---|
A | 50.18122 |
B | 10.12185 |
C | 0.962764 |
D | -0.028406 |
E | -0.165604 |
F | -377.3880 |
G | 143.5635 |
H | -361.4143 |
Reference | Chase, 1998 |
Comment | Data last reviewed in September, 1964 |

Reaction thermochemistry data

Data compiled by: Hussein Y. Afeefy, Joel F. Liebman, and Stephen E. Stein
Individual Reactions
2 +
=
+
+ CNO.Na
By formula: 2HNaO + CBrN = BrNa + H2O + CNO.Na
Quantity | Value | Units | Method | Reference | Comment |
---|---|---|---|---|---|
ΔrH° | -234.6 ± 0.71 | kJ/mol | Cm | Lord and Woolf, 1954 | solid phase; Heat of hydrolysis |

Gas phase ion energetics data

Data evaluated as indicated in comments:
L - Sharon G. Lias
Data compiled as indicated in comments:
LLK - Sharon G. Lias, Rhoda D. Levin, and Sherif A. Kafafi
B - John E. Bartmess
Quantity | Value | Units | Method | Reference | Comment |
---|---|---|---|---|---|
IE (evaluated) | 8.3 ± 0.1 | eV | N/A | N/A | L |
Electron affinity determinations
EA (eV) | Method | Reference | Comment |
---|---|---|---|
0.788 ± 0.010 | LPES | Miller, Leopold, et al., 1986 | B |
0.940004 | NBAE | De Vreugd, Wijnaendts van Resandt, et al., 1979 | B |
Ionization energy determinations
IE (eV) | Method | Reference | Comment |
---|---|---|---|
8.3 ± 0.1 | PE | Potts and Price, 1977 | LLK |
8.3 ± 0.1 | PE | Potts, Williams, et al., 1974 | LLK |
8.7 | PE | Goodman, Allen, et al., 1974 | Vertical value; LLK |

Constants of diatomic molecules

Data compiled by: Klaus P. Huber and Gerhard H. Herzberg
Data collected through March, 1977
Symbol | Meaning |
---|---|
State | electronic state and / or symmetry symbol |
Te | minimum electronic energy (cm-1) |
ωe | vibrational constant – first term (cm-1) |
ωexe | vibrational constant – second term (cm-1) |
ωeye | vibrational constant – third term (cm-1) |
Be | rotational constant in equilibrium position (cm-1) |
αe | rotational constant – first term (cm-1) |
γe | rotation-vibration interaction constant (cm-1) |
De | centrifugal distortion constant (cm-1) |
βe | rotational constant – first term, centrifugal force (cm-1) |
re | internuclear distance (Å) |
Trans. | observed transition(s) corresponding to electronic state |
ν00 | position of 0-0 band (units noted in table) |
State | Te | ωe | ωexe | ωeye | Be | αe | γe | De | βe | re | Trans. | ν00 |
---|---|---|---|---|---|---|---|---|---|---|---|---|
The electron energy loss spectrum has peaks at 5.2, 7.1, 8.8, (20.0), 31.0 eV. | ||||||||||||
↳Geiger and Pfeiffer, 1968 | ||||||||||||
Continuous absorption above ~30000 cm-1 with maximum near 35500 and 40000 cm -1. 1 2 | ||||||||||||
A 3 | A ↔ X | |||||||||||
↳Muller, 1927; Beutler and Josephy, 1929; Levi, 1934 | ||||||||||||
X 1Σ+ | 0 | 302.1 4 (Z) | (1.50) | 0.15125331 | 0.00094095 | 0.00000243 | 1.5535E-7 | -0.0050E-7 | 2.502038 5 | |||
↳Rice and Klemperer, 1957 | ||||||||||||
Rotation sp. | ||||||||||||
↳Honig, Mandel, et al., 1954; Rusk and Gordy, 1962 | ||||||||||||
Mol. beam electric reson. 6 | ||||||||||||
↳Hebert, Lovas, et al., 1968 | ||||||||||||
Mol. beam magnetic reson. | ||||||||||||
↳Nierenberg and Ramsey, 1947; Logan, Cote, et al., 1952; Cote and Kusch, 1953 |

References

Chase, 1998
Chase, M.W., Jr.,
NIST-JANAF Themochemical Tables, Fourth Edition,
J. Phys. Chem. Ref. Data, Monograph 9, 1998, 1-1951. [all data]
Lord and Woolf, 1954
Lord, G.; Woolf, A.A.,
The cyanogen halides. Part III. Their heats of formation and free energies,
J. Chem. Soc., 1954, 2546-2551. [all data]
Miller, Leopold, et al., 1986
Miller, T.M.; Leopold, D.G.; Murray, K.K.; Lineberger, W.C.,
Electron Affinities of the Alkali Halides and the Structure of their Negative Ions,
J. Chem. Phys., 1986, 85, 5, 2368, https://doi.org/10.1063/1.451091
. [all data]
De Vreugd, Wijnaendts van Resandt, et al., 1979
De Vreugd, C.; Wijnaendts van Resandt, R.W.; Los, J.; Smith, B.,
Differential Cross Sections for Collisions of Negative Halogen Ions and Alkali Atoms,
Chem. Phys., 1979, 42, 3, 305, https://doi.org/10.1016/0301-0104(79)80078-6
. [all data]
Potts and Price, 1977
Potts, A.W.; Price, W.C.,
Photoelectron studies of ionic materials using molecular beam techniques,
Phys. Scr., 1977, 16, 191. [all data]
Potts, Williams, et al., 1974
Potts, A.W.; Williams, T.A.; Price, W.C.,
Photoelectron spectra and electronic structure of diatomic alkali halides,
Proc. Roy. Soc. London A, 1974, 341, 147. [all data]
Goodman, Allen, et al., 1974
Goodman, T.D.; Allen, J.D., Jr.; Cusachs, L.C.; Schweitzer, G.K.,
The photoelectron spectra of gaseous alkali halides,
J. Electron Spectrosc. Relat. Phenom., 1974, 3, 289. [all data]
Geiger and Pfeiffer, 1968
Geiger, J.; Pfeiffer, H.-C.,
Untersuchung der Anregung innerer Elektronen von Alkalihalogenidmolekulen im Energieverlustspektrum von 25 keV-Elektronen,
Z. Phys., 1968, 208, 105. [all data]
Muller, 1927
Muller, L.A.,
4. absorptionsspektren der alkalihalogenide in wasseriger losung und im dampf,
Ann. Phys. (Leipzig), 1927, 82, 39. [all data]
Beutler and Josephy, 1929
Beutler, H.; Josephy, B.,
Resonanz bei Stoben in der fluoreszenz und chemilumineszenz,
Z. Phys., 1929, 53, 747. [all data]
Levi, 1934
Levi,
Dissertation, Berlin, 1934, 0. [all data]
Rice and Klemperer, 1957
Rice, S.A.; Klemperer, W.,
Spectra of the alkali halides. II. The infrared spectra of the sodium and potassium halides, RbCl, and CsCl,
J. Chem. Phys., 1957, 27, 573. [all data]
Honig, Mandel, et al., 1954
Honig, A.; Mandel, M.; Stitch, M.L.; Townes, C.H.,
Microwave spectra of the alkali halides,
Phys. Rev., 1954, 96, 629. [all data]
Rusk and Gordy, 1962
Rusk, J.R.; Gordy, W.,
Millimeter wave molecular beam spectroscopy: alkali bromides and iodides,
Phys. Rev., 1962, 127, 817. [all data]
Hebert, Lovas, et al., 1968
Hebert, A.J.; Lovas, F.J.; Melendres, C.A.; Hollowell, C.D.; Story, T.L., Jr.; Street, K., Jr.,
Dipole moments of some alkali halide molecules by the molecular beam electric resonance method,
J. Chem. Phys., 1968, 48, 2824. [all data]
Nierenberg and Ramsey, 1947
Nierenberg, W.A.; Ramsey, N.F.,
The radiofrequency spectra of the sodium halides,
Phys. Rev., 1947, 72, 1075. [all data]
Logan, Cote, et al., 1952
Logan, R.A.; Cote, R.E.; Kusch, P.,
The sign of the quadrupole interaction energy in diatomic molecules,
Phys. Rev., 1952, 86, 280. [all data]
Cote and Kusch, 1953
Cote, R.E.; Kusch, P.,
Low frequency resonances in the spectra of diatomic molecules,
Phys. Rev., 1953, 90, 103. [all data]
Davidovits and Brodhead, 1967
Davidovits, P.; Brodhead, D.C.,
Ultraviolet absorption cross sections for the alkali halide vapors,
J. Chem. Phys., 1967, 46, 2968. [all data]
Earl and Herm, 1974
Earl, B.L.; Herm, R.R.,
Photodissociation of NaBr, Nal, and Kl vapors and collisional quenching of Na* (32P), K* (42P), and K* (52P) by foreign gases,
J. Chem. Phys., 1974, 60, 4568. [all data]
Oppenheimer and Berry, 1971
Oppenheimer, M.; Berry, R.S.,
Ultraviolet spectra of alkali halides in inert matrices,
J. Chem. Phys., 1971, 54, 5058. [all data]
Melendres, 1968
Melendres,
Thesis, University of California, California, 1968, 1. [all data]
Miller, Finney, et al., 1973
Miller, C.E.; Finney, A.A.; Inman, F.W.,
Rotational and hyperfine structure constants for groups IA and IIIA monohalide and monohydride molecules,
At. Data, 1973, 5, 1. [all data]
Brewer and Brackett, 1961
Brewer, L.; Brackett, E.,
The dissociation energies of gaseous alkali halides,
Chem. Rev., 1961, 61, 425. [all data]
Stull and Prophet, 1971
Stull, D.R.; Prophet, H.,
JANAF Thermochemical Tables. Second Edition, Office of SRD (NSRDS-NBS 37), Washington, D.C., 1971, 0. [all data]
Bulewicz, Phillips, et al., 1961
Bulewicz, E.M.; Phillips, L.F.; Sugden, T.M.,
Determination of dissociation constants and heats of formation of simple molecules by flame photometry. Part 8. Stabilities of the gaseous diatomic halides of certain metals,
Trans. Faraday Soc., 1961, 57, 921. [all data]