sodium chloride
- Formula: ClNa
- Molecular weight: 58.443
- IUPAC Standard InChIKey: FAPWRFPIFSIZLT-UHFFFAOYSA-M
- CAS Registry Number: 7647-14-5
- Chemical structure:
View 3d structure (requires JavaScript / HTML 5) - Other names: Salt

Gas phase thermochemistry data

Quantity | Value | Units | Method | Reference | Comment |
---|---|---|---|---|---|
ΔfH°gas | -181.42 | kJ/mol | Review | Chase, 1998 | Data last reviewed in September, 1964 |
Quantity | Value | Units | Method | Reference | Comment |
S°gas,1 bar | 229.79 | J/mol*K | Review | Chase, 1998 | Data last reviewed in September, 1964 |
Gas Phase Heat Capacity (Shomate Equation)
Cp° = A + B*t + C*t2 + D*t3 +
E/t2
H° − H°298.15= A*t + B*t2/2 +
C*t3/3 + D*t4/4 − E/t + F − H
S° = A*ln(t) + B*t + C*t2/2 + D*t3/3 −
E/(2*t2) + G
Cp = heat capacity (J/mol*K)
H° = standard enthalpy (kJ/mol)
S° = standard entropy (J/mol*K)
t = temperature (K) / 1000.
View plot Requires a JavaScript / HTML 5 canvas capable browser.
Temperature (K) | 2500. to 6000. |
---|---|
A | 37.29885 |
B | 0.792454 |
C | -0.027018 |
D | 0.002313 |
E | -0.157114 |
F | -193.1004 |
G | 273.8077 |
H | -181.4182 |
Reference | Chase, 1998 |
Comment | Data last reviewed in September, 1964 |

Condensed phase thermochemistry data

Quantity | Value | Units | Method | Reference | Comment |
---|---|---|---|---|---|
ΔfH°liquid | -385.92 | kJ/mol | Review | Chase, 1998 | Data last reviewed in September, 1964 |
Quantity | Value | Units | Method | Reference | Comment |
S°liquid,1 bar | 95.06 | J/mol*K | Review | Chase, 1998 | Data last reviewed in September, 1964 |
Quantity | Value | Units | Method | Reference | Comment |
ΔfH°solid | -411.12 | kJ/mol | Review | Chase, 1998 | Data last reviewed in September, 1964 |
Quantity | Value | Units | Method | Reference | Comment |
S°solid | 72.11 | J/mol*K | Review | Chase, 1998 | Data last reviewed in September, 1964 |
Liquid Phase Heat Capacity (Shomate Equation)
Cp° = A + B*t + C*t2 + D*t3 +
E/t2
H° − H°298.15= A*t + B*t2/2 +
C*t3/3 + D*t4/4 − E/t + F − H
S° = A*ln(t) + B*t + C*t2/2 + D*t3/3 −
E/(2*t2) + G
Cp = heat capacity (J/mol*K)
H° = standard enthalpy (kJ/mol)
S° = standard entropy (J/mol*K)
t = temperature (K) / 1000.
View plot Requires a JavaScript / HTML 5 canvas capable browser.
Temperature (K) | 1074. to 2500. |
---|---|
A | -42.44780 |
B | 113.5260 |
C | -43.64660 |
D | 5.896630 |
E | 39.13860 |
F | -305.5610 |
G | 91.06390 |
H | -385.9230 |
Reference | Chase, 1998 |
Comment | Data last reviewed in September, 1964 |
Solid Phase Heat Capacity (Shomate Equation)
Cp° = A + B*t + C*t2 + D*t3 +
E/t2
H° − H°298.15= A*t + B*t2/2 +
C*t3/3 + D*t4/4 − E/t + F − H
S° = A*ln(t) + B*t + C*t2/2 + D*t3/3 −
E/(2*t2) + G
Cp = heat capacity (J/mol*K)
H° = standard enthalpy (kJ/mol)
S° = standard entropy (J/mol*K)
t = temperature (K) / 1000.
View plot Requires a JavaScript / HTML 5 canvas capable browser.
Temperature (K) | 298. to 1073. |
---|---|
A | 50.72389 |
B | 6.672267 |
C | -2.517167 |
D | 10.15934 |
E | -0.200675 |
F | -427.2115 |
G | 130.3973 |
H | -411.1203 |
Reference | Chase, 1998 |
Comment | Data last reviewed in September, 1964 |

Phase change data

Antoine Equation Parameters
log10(P) = A − (B / (T + C))
P = vapor pressure (bar)
T = temperature (K)
View plot Requires a JavaScript / HTML 5 canvas capable browser.
Temperature (K) | A | B | C | Reference | Comment |
---|---|---|---|---|---|
859.99 to 1239.99 | 3.56682 | 5200.904 | -317.409 | Ewing and Stern, 1974 | Coefficents calculated by NIST from author's data. |
1138. to 1738. | 5.07184 | 8388.497 | -82.638 | Stull, 1947 | Coefficents calculated by NIST from author's data. |

Reaction thermochemistry data

Data compiled as indicated in comments:
ALS - Hussein Y. Afeefy, Joel F. Liebman, and Stephen E. Stein
M - Michael M. Meot-Ner (Mautner) and Sharon G. Lias
MS - José A. Martinho Simões
Individual Reactions
By formula: 4Na + C2ClF3 = 2C + ClNa + 3FNa
Quantity | Value | Units | Method | Reference | Comment |
---|---|---|---|---|---|
ΔrH° | -1576.1 ± 5.4 | kJ/mol | Cm | Kolesov, Zenkov, et al., 1963 | gas phase; Reanalyzed by Cox and Pilcher, 1970, Original value = -1543. ± 5.4 kJ/mol; ALS |
By formula: Na+ + ClNa = (Na+ • ClNa)
Quantity | Value | Units | Method | Reference | Comment |
---|---|---|---|---|---|
ΔrH° | 177. | kJ/mol | MS | Chupka, 1959 | gas phase; Knudsen cell; M |
Quantity | Value | Units | Method | Reference | Comment |
ΔrS° | 73.6 | J/mol*K | MS | Chupka, 1959 | gas phase; Knudsen cell; M |
3 +
= CNa2O3 +
+
+
By formula: 3HNaO + C3H5ClO2 = CNa2O3 + C2H6O + ClNa + H2O
Quantity | Value | Units | Method | Reference | Comment |
---|---|---|---|---|---|
ΔrH° | -323.3 ± 1.7 | kJ/mol | Cm | Davies, Finch, et al., 1980 | liquid phase; Heat of hydrolysis; ALS |
2 +
=
+
+ CNO.Na
By formula: 2HNaO + CClN = ClNa + H2O + CNO.Na
Quantity | Value | Units | Method | Reference | Comment |
---|---|---|---|---|---|
ΔrH° | -277.5 ± 0.4 | kJ/mol | Cm | Lord and Woolf, 1954 | solid phase; Heat of Hydrolysis; ALS |
C6H5NaO (cr) + ( • 552
) (solution) =
(cr) +
(cr)
By formula: C6H5NaO (cr) + (HCl • 552H2O) (solution) = C6H6O (cr) + ClNa (cr)
Quantity | Value | Units | Method | Reference | Comment |
---|---|---|---|---|---|
ΔrH° | -78.0 ± 5.7 | kJ/mol | RSC | Leal, Pires de Matos, et al., 1991 | MS |
(cr) + (
• 552
) (solution) =
(l) +
(cr)
By formula: CH3NaO (cr) + (HCl • 552H2O) (solution) = CH4O (l) + ClNa (cr)
Quantity | Value | Units | Method | Reference | Comment |
---|---|---|---|---|---|
ΔrH° | -108.0 ± 3.1 | kJ/mol | RSC | Leal, Pires de Matos, et al., 1991 | MS |

Gas phase ion energetics data

Data compiled as indicated in comments:
LBLHLM - Sharon G. Lias, John E. Bartmess, Joel F. Liebman, John L. Holmes, Rhoda D. Levin, and W. Gary Mallard
LLK - Sharon G. Lias, Rhoda D. Levin, and Sherif A. Kafafi
RDSH - Henry M. Rosenstock, Keith Draxl, Bruce W. Steiner, and John T. Herron
B - John E. Bartmess
Electron affinity determinations
EA (eV) | Method | Reference | Comment |
---|---|---|---|
0.727 ± 0.010 | LPES | Miller, Leopold, et al., 1986 | B |
0.769975 | NBAE | De Vreugd, Wijnaendts van Resandt, et al., 1979 | B |
>1.27998 | EIAE | Ebinghaus, 1964 | From (NaCl)2; B |
Ionization energy determinations
IE (eV) | Method | Reference | Comment |
---|---|---|---|
9.2 | EI | Williams, 1982 | LBLHLM |
10.0 | EI | Itoh, Sasamoto, et al., 1981 | LLK |
8.9 ± 0.1 | PE | Potts, Williams, et al., 1974 | LLK |
8.92 ± 0.06 | PI | Berkowitz and Chupka, 1966 | RDSH |
9.80 ± 0.04 | PE | Potts and Price, 1977 | Vertical value; LLK |
9.0 | PE | Goodman, Allen, et al., 1974 | Vertical value; LLK |
Appearance energy determinations
Ion | AE (eV) | Other Products | Method | Reference | Comment |
---|---|---|---|---|---|
Na+ | 10.3 | Cl | EI | Itoh, Sasamoto, et al., 1981 | LLK |
Na+ | 9.5 ± 0.2 | Cl | EI | Bloom, Hastie, et al., 1968 | RDSH |

Ion clustering data

Data compiled by: Michael M. Meot-Ner (Mautner) and Sharon G. Lias
Clustering reactions
By formula: Na+ + ClNa = (Na+ • ClNa)
Quantity | Value | Units | Method | Reference | Comment |
---|---|---|---|---|---|
ΔrH° | 177. | kJ/mol | MS | Chupka, 1959 | gas phase; Knudsen cell |
Quantity | Value | Units | Method | Reference | Comment |
ΔrS° | 73.6 | J/mol*K | MS | Chupka, 1959 | gas phase; Knudsen cell |

Constants of diatomic molecules

Data compiled by: Klaus P. Huber and Gerhard H. Herzberg
Data collected through March, 1977
Symbol | Meaning |
---|---|
State | electronic state and / or symmetry symbol |
Te | minimum electronic energy (cm-1) |
ωe | vibrational constant – first term (cm-1) |
ωexe | vibrational constant – second term (cm-1) |
ωeye | vibrational constant – third term (cm-1) |
Be | rotational constant in equilibrium position (cm-1) |
αe | rotational constant – first term (cm-1) |
γe | rotation-vibration interaction constant (cm-1) |
De | centrifugal distortion constant (cm-1) |
βe | rotational constant – first term, centrifugal force (cm-1) |
re | internuclear distance (Å) |
Trans. | observed transition(s) corresponding to electronic state |
ν00 | position of 0-0 band (units noted in table) |
State | Te | ωe | ωexe | ωeye | Be | αe | γe | De | βe | re | Trans. | ν00 |
---|---|---|---|---|---|---|---|---|---|---|---|---|
Continuous absorption above ~34000 cm-1 with maxima at (38500) and 42000 1 cm-1. 2 | ||||||||||||
A 3 | A ↔ X | |||||||||||
↳Levi, 1934 | ||||||||||||
X 1Σ+ | 0 | 366 4 (Z) | (2.05) | 0.21806309 | 0.00162482 | 5.14E-6 | 3.1202E-7 5 | -8.3E-10 | 2.360795 6 | |||
↳Rice and Klemperer, 1957 | ||||||||||||
Rotation sp. | ||||||||||||
↳Stitch, Honig, et al., 1952; Honig, Mandel, et al., 1954; Clouser and Gordy, 1964 | ||||||||||||
Mol. beam electric 7 | ||||||||||||
↳Hebert, Lovas, et al., 1968; Cederberg and Miller, 1969; de Leeuw, van Wachem, et al., 1970 | ||||||||||||
and magnetic reson. | ||||||||||||
↳Nierenberg and Ramsey, 1947; Zeiger and Bolef, 1952; Logan, Cote, et al., 1952; Cote and Kusch, 1953; Ochs, Cote, et al., 1953 |

References

Chase, 1998
Chase, M.W., Jr.,
NIST-JANAF Themochemical Tables, Fourth Edition,
J. Phys. Chem. Ref. Data, Monograph 9, 1998, 1-1951. [all data]
Ewing and Stern, 1974
Ewing, C.T.; Stern, K.H.,
Equilibrium Vaporization Rates and Vapor Pressures of Solid and Liquid Sodium Chloride, Potassium Chloride, Potassium Bromide, Cesium Iodide, and Lithium Fluoride,
J. Phys. Chem., 1974, 78, 20, 1998-2005, https://doi.org/10.1021/j100613a005
. [all data]
Stull, 1947
Stull, Daniel R.,
Vapor Pressure of Pure Substances. Organic and Inorganic Compounds,
Ind. Eng. Chem., 1947, 39, 4, 517-540, https://doi.org/10.1021/ie50448a022
. [all data]
Kolesov, Zenkov, et al., 1963
Kolesov, V.P.; Zenkov, I.D.; Skuratov, S.M.,
Standard enthalpy of formation of chlorotrifluoroethylene,
Russ. J. Phys. Chem. (Engl. Transl.), 1963, 37, 115-116. [all data]
Cox and Pilcher, 1970
Cox, J.D.; Pilcher, G.,
Thermochemistry of Organic and Organometallic Compounds, Academic Press, New York, 1970, 1-636. [all data]
Chupka, 1959
Chupka, W.A.,
Dissociation Energies of Some Gaseous Halide Complex Ions and the Hydrated Ion K(H2O)+,
J. Chem. Phys., 1959, 40, 2, 458, https://doi.org/10.1063/1.1729974
. [all data]
Davies, Finch, et al., 1980
Davies, R.H.; Finch, A.; Gardner, P.J.,
The standard enthalpy of formation of liquid and gaseous ethylchloroformate (C3H5O2Cl),
J. Chem. Thermodyn., 1980, 12, 291-296. [all data]
Lord and Woolf, 1954
Lord, G.; Woolf, A.A.,
The cyanogen halides. Part III. Their heats of formation and free energies,
J. Chem. Soc., 1954, 2546-2551. [all data]
Leal, Pires de Matos, et al., 1991
Leal, J.P.; Pires de Matos, A.; Martinho Simões, J.A.,
J. Organometal. Chem., 1991, 403, 1. [all data]
Miller, Leopold, et al., 1986
Miller, T.M.; Leopold, D.G.; Murray, K.K.; Lineberger, W.C.,
Electron Affinities of the Alkali Halides and the Structure of their Negative Ions,
J. Chem. Phys., 1986, 85, 5, 2368, https://doi.org/10.1063/1.451091
. [all data]
De Vreugd, Wijnaendts van Resandt, et al., 1979
De Vreugd, C.; Wijnaendts van Resandt, R.W.; Los, J.; Smith, B.,
Differential Cross Sections for Collisions of Negative Halogen Ions and Alkali Atoms,
Chem. Phys., 1979, 42, 3, 305, https://doi.org/10.1016/0301-0104(79)80078-6
. [all data]
Ebinghaus, 1964
Ebinghaus, H.Z.,
Negative Ionen aus Alkalihalogeniden und Electronenaffinitaten der Alkalimetalle und Alkalihalogenide,
Z. Naturfor., 1964, 19A, 727. [all data]
Williams, 1982
Williams, D.J.,
Mass spectrometric study of the vaporization of the alkali chloride-cuprous chloride systems,
Aust. J. Chem., 1982, 35, 1531. [all data]
Itoh, Sasamoto, et al., 1981
Itoh, M.; Sasamoto, T.; Sata, T.,
Mass-spectrometric measurement of activities in both solid and liquid solutions of the KCl-NaCl system,
Bull. Chem. Soc. Jpn., 1981, 54, 3391. [all data]
Potts, Williams, et al., 1974
Potts, A.W.; Williams, T.A.; Price, W.C.,
Photoelectron spectra and electronic structure of diatomic alkali halides,
Proc. Roy. Soc. London A, 1974, 341, 147. [all data]
Berkowitz and Chupka, 1966
Berkowitz, J.; Chupka, W.A.,
Photoionization of high-temperature vapors. I. The iodides of sodium, magnesium, and thallium,
J. Chem. Phys., 1966, 45, 1287. [all data]
Potts and Price, 1977
Potts, A.W.; Price, W.C.,
Photoelectron studies of ionic materials using molecular beam techniques,
Phys. Scr., 1977, 16, 191. [all data]
Goodman, Allen, et al., 1974
Goodman, T.D.; Allen, J.D., Jr.; Cusachs, L.C.; Schweitzer, G.K.,
The photoelectron spectra of gaseous alkali halides,
J. Electron Spectrosc. Relat. Phenom., 1974, 3, 289. [all data]
Bloom, Hastie, et al., 1968
Bloom, H.; Hastie, J.W.; Morrison, J.D.,
Ionization and dissociation of the alkali halides by electron impact,
J. Phys. Chem., 1968, 72, 3041. [all data]
Levi, 1934
Levi,
Dissertation, Berlin, 1934, 0. [all data]
Rice and Klemperer, 1957
Rice, S.A.; Klemperer, W.,
Spectra of the alkali halides. II. The infrared spectra of the sodium and potassium halides, RbCl, and CsCl,
J. Chem. Phys., 1957, 27, 573. [all data]
Stitch, Honig, et al., 1952
Stitch, M.L.; Honig, A.; Townes, C.H.,
Microwave spectroscopy at high temperature-spectra of CsCl and NaCl,
Phys. Rev., 1952, 86, 813. [all data]
Honig, Mandel, et al., 1954
Honig, A.; Mandel, M.; Stitch, M.L.; Townes, C.H.,
Microwave spectra of the alkali halides,
Phys. Rev., 1954, 96, 629. [all data]
Clouser and Gordy, 1964
Clouser, P.L.; Gordy, W.,
Millimeter-wave molecular-beam spectroscopy: alkali chlorides,
Phys. Rev., 1964, 134, 863. [all data]
Hebert, Lovas, et al., 1968
Hebert, A.J.; Lovas, F.J.; Melendres, C.A.; Hollowell, C.D.; Story, T.L., Jr.; Street, K., Jr.,
Dipole moments of some alkali halide molecules by the molecular beam electric resonance method,
J. Chem. Phys., 1968, 48, 2824. [all data]
Cederberg and Miller, 1969
Cederberg, J.W.; Miller, C.E.,
Hyperfine spectrum of NaCl by molecular-beam electric resonance,
J. Chem. Phys., 1969, 50, 3547. [all data]
de Leeuw, van Wachem, et al., 1970
de Leeuw, F.H.; van Wachem, R.; Dymanus, A.,
Radio-frequency spectra of NaCl by the molecular-beam electric resonance method,
J. Chem. Phys., 1970, 53, 981. [all data]
Nierenberg and Ramsey, 1947
Nierenberg, W.A.; Ramsey, N.F.,
The radiofrequency spectra of the sodium halides,
Phys. Rev., 1947, 72, 1075. [all data]
Zeiger and Bolef, 1952
Zeiger, H.J.; Bolef, D.I.,
Molecular beam magnetic resonance spectra of TlCl35 and TlCl37 at zero field,
Phys. Rev., 1952, 85, 788. [all data]
Logan, Cote, et al., 1952
Logan, R.A.; Cote, R.E.; Kusch, P.,
The sign of the quadrupole interaction energy in diatomic molecules,
Phys. Rev., 1952, 86, 280. [all data]
Cote and Kusch, 1953
Cote, R.E.; Kusch, P.,
Low frequency resonances in the spectra of diatomic molecules,
Phys. Rev., 1953, 90, 103. [all data]
Ochs, Cote, et al., 1953
Ochs, S.A.; Cote, R.E.; Kusch, P.,
On the radiofrequency spectrum of the components of a sodium chloride beam. The dimerization of the alkali halides,
J. Chem. Phys., 1953, 21, 459. [all data]
Geiger and Pfeiffer, 1968
Geiger, J.; Pfeiffer, H.-C.,
Untersuchung der Anregung innerer Elektronen von Alkalihalogenidmolekulen im Energieverlustspektrum von 25 keV-Elektronen,
Z. Phys., 1968, 208, 105. [all data]
Davidovits and Brodhead, 1967
Davidovits, P.; Brodhead, D.C.,
Ultraviolet absorption cross sections for the alkali halide vapors,
J. Chem. Phys., 1967, 46, 2968. [all data]
Ismail, Hauge, et al., 1975
Ismail, Z.K.; Hauge, R.H.; Margrave, J.L.,
Infrared studies of matrix isolated sodium and potassium chloride and cyanide dimers,
J. Mol. Spectrosc., 1975, 54, 402. [all data]
Brewer and Brackett, 1961
Brewer, L.; Brackett, E.,
The dissociation energies of gaseous alkali halides,
Chem. Rev., 1961, 61, 425. [all data]
Gurvich and Veits, 1957
Gurvich, L.V.; Veits, I.V.,
Spectroscopic investigation of the equilibrium of the reaction NaCl = Na + Cl in a hydrogen-chlorine flame and the energy of dissociation of NaCl,
Dokl. Phys. Chem. Engl. Transl., 1957, 116, 639-640. [all data]
Gurvich and Veits, 1958
Gurvich, L.V.; Veits, I.V.,
Determination of molecular dissociation energies from flame reaction equilibrium studies,
Bull. Acad. Sci. USSR, Phys. Ser. Engl. Transl., 1958, 22, 670-673. [all data]
Bulewicz, Phillips, et al., 1961
Bulewicz, E.M.; Phillips, L.F.; Sugden, T.M.,
Determination of dissociation constants and heats of formation of simple molecules by flame photometry. Part 8. Stabilities of the gaseous diatomic halides of certain metals,
Trans. Faraday Soc., 1961, 57, 921. [all data]
Jordan, 1976
Jordan, K.D.,
Correlation between molecular electron affinities and dipole moments,
J. Chem. Phys., 1976, 65, 1214. [all data]