Hydrogen chloride
- Formula: ClH
- Molecular weight: 36.461
- IUPAC Standard InChIKey: VEXZGXHMUGYJMC-UHFFFAOYSA-N
- CAS Registry Number: 7647-01-0
- Chemical structure:
View 3d structure (requires JavaScript / HTML 5) - Isotopologues:
- Other names: Hydrochloric ccid; Anhydrous hydrochloric acid; Chlorohydric acid; Hydrochloric acid gas; Hydrochloride; Muriatic acid; Salzsaeure; HCl; Hydrochloric acid, anhydrous; Hydrogen-chloride-anhydrous-; Acide chlorhydrique; Acido cloridrico; Chloorwaterstof; Chlorowodor; Chlorwasserstoff; NA 1789; Spirits of salt; UN 1050; UN 1789; UN 2186; Anhydrous hydrogen chloride; Hydrogen chloride (acid); Marine acid; Soldering acid; Spirit of salt; Spirits of salts; Hydrogen chloride (HCl); NSC 77365; Hydrochloric acid

Gas phase thermochemistry data

Quantity | Value | Units | Method | Reference | Comment |
---|---|---|---|---|---|
ΔfH°gas | -92.31 ± 0.10 | kJ/mol | Review | Cox, Wagman, et al., 1984 | CODATA Review value |
ΔfH°gas | -92.31 | kJ/mol | Review | Chase, 1998 | Data last reviewed in September, 1964 |
Quantity | Value | Units | Method | Reference | Comment |
S°gas,1 bar | 186.902 ± 0.005 | J/mol*K | Review | Cox, Wagman, et al., 1984 | CODATA Review value |
S°gas,1 bar | 186.90 | J/mol*K | Review | Chase, 1998 | Data last reviewed in September, 1964 |
Gas Phase Heat Capacity (Shomate Equation)
Cp° = A + B*t + C*t2 + D*t3 +
E/t2
H° − H°298.15= A*t + B*t2/2 +
C*t3/3 + D*t4/4 − E/t + F − H
S° = A*ln(t) + B*t + C*t2/2 + D*t3/3 −
E/(2*t2) + G
Cp = heat capacity (J/mol*K)
H° = standard enthalpy (kJ/mol)
S° = standard entropy (J/mol*K)
t = temperature (K) / 1000.
View plot Requires a JavaScript / HTML 5 canvas capable browser.
Temperature (K) | 298. to 1200. | 1200. to 6000. |
---|---|---|
A | 32.12392 | 31.91923 |
B | -13.45805 | 3.203184 |
C | 19.86852 | -0.541539 |
D | -6.853936 | 0.035925 |
E | -0.049672 | -3.438525 |
F | -101.6206 | -108.0150 |
G | 228.6866 | 218.2768 |
H | -92.31201 | -92.31201 |
Reference | Chase, 1998 | Chase, 1998 |
Comment | Data last reviewed in September, 1964 | Data last reviewed in September, 1964 |

Reaction thermochemistry data

Data compiled as indicated in comments:
B - John E. Bartmess
M - Michael M. Meot-Ner (Mautner) and Sharon G. Lias
ALS - Hussein Y. Afeefy, Joel F. Liebman, and Stephen E. Stein
MS - José A. Martinho Simões
Reactions 1 to 50
By formula: Cl- + HCl = (Cl- • HCl)
Bond type: Hydrogen bond (negative ion to hydride)
Quantity | Value | Units | Method | Reference | Comment |
---|---|---|---|---|---|
ΔrH° | 124. ± 4.2 | kJ/mol | N/A | Metz, Kitsopoulos, et al., 1988 | gas phase; Affinity: shift in apparent EA from lesser-solvated ion. Ignores any neutral-neutral bond.; B |
ΔrH° | 99.6 ± 8.4 | kJ/mol | TDEq | Caldwell and Kebarle, 1985 | gas phase; B,M |
ΔrH° | 96.7 ± 8.4 | kJ/mol | IMRE | Larson and McMahon, 1984 | gas phase; B,M |
ΔrH° | 99.16 ± 0.84 | kJ/mol | TDAs | Yamdagni and Kebarle, 1974 | gas phase; B,M |
ΔrH° | 85.4 | kJ/mol | HPMS | Upschulte, Evans, et al., 1986 | gas phase; From thermochemical cycle(Cl-)H2O/HCl, Entropy change calculated or estimated; Keesee and Castleman, 1980; M |
Quantity | Value | Units | Method | Reference | Comment |
ΔrS° | 93.3 | J/mol*K | PHPMS | Caldwell and Kebarle, 1985 | gas phase; switching reaction(Cl-)SO2; M |
ΔrS° | 98.3 | J/mol*K | PHPMS | Yamdagni and Kebarle, 1974 | gas phase; M |
ΔrS° | 98.3 | J/mol*K | N/A | Larson and McMahon, 1984, 2 | gas phase; switching reaction(Cl-)t-C4H9OH, Entropy change calculated or estimated; French, Ikuta, et al., 1982; M |
ΔrS° | 95.4 | J/mol*K | N/A | Upschulte, Evans, et al., 1986 | gas phase; From thermochemical cycle(Cl-)H2O/HCl, Entropy change calculated or estimated; Keesee and Castleman, 1980; M |
Quantity | Value | Units | Method | Reference | Comment |
ΔrG° | 68.2 ± 8.4 | kJ/mol | IMRE | Larson and McMahon, 1987 | gas phase; K = 0.60 for HCl..Cl- + DCL <=> DCl..Cl- + HCl, anchored to Larson and McMahon, 1984, 32; B |
ΔrG° | 72. ± 11. | kJ/mol | TDEq | Caldwell and Kebarle, 1985 | gas phase; B |
ΔrG° | 66.9 ± 8.4 | kJ/mol | IMRE | Larson and McMahon, 1984 | gas phase; B,M |
ΔrG° | 69.9 ± 1.3 | kJ/mol | TDAs | Yamdagni and Kebarle, 1974 | gas phase; B |
ΔrG° | 56.9 | kJ/mol | HPMS | Upschulte, Evans, et al., 1986 | gas phase; From thermochemical cycle(Cl-)H2O/HCl, Entropy change calculated or estimated; Keesee and Castleman, 1980; M |
Quantity | Value | Units | Method | Reference | Comment |
---|---|---|---|---|---|
ΔrH° | 1394.9 | kJ/mol | N/A | Martin and Hepburn, 1998 | gas phase; Given: ΔHacid(0K)=116288.7±0.6 cm-1, or 332.486±0.002 kcal/mol; B |
ΔrH° | 1396. ± 8.8 | kJ/mol | G+TS | Fujio, McIver, et al., 1981 | gas phase; value altered from reference due to change in acidity scale; B |
ΔrH° | 1377.0 | kJ/mol | N/A | Check, Faust, et al., 2001 | gas phase; FeCC-(q); ; ΔS(EA)=5.0; B |
Quantity | Value | Units | Method | Reference | Comment |
ΔrG° | 1372.8 ± 0.42 | kJ/mol | H-TS | Martin and Hepburn, 1998 | gas phase; Given: ΔHacid(0K)=116288.7±0.6 cm-1, or 332.486±0.002 kcal/mol; B |
ΔrG° | 1374. ± 8.4 | kJ/mol | IMRE | Fujio, McIver, et al., 1981 | gas phase; value altered from reference due to change in acidity scale; B |
ΔrG° | 1354.4 | kJ/mol | N/A | Check, Faust, et al., 2001 | gas phase; FeCC-(q); ; ΔS(EA)=5.0; B |
By formula: (Cl- • HCl) + HCl = (Cl- • 2HCl)
Bond type: Hydrogen bond (negative ion to hydride)
Quantity | Value | Units | Method | Reference | Comment |
---|---|---|---|---|---|
ΔrH° | 63.60 ± 0.84 | kJ/mol | TDAs | Yamdagni and Kebarle, 1974 | gas phase; B,M |
ΔrH° | 58.6 | kJ/mol | PHPMS | Caldwell and Kebarle, 1985 | gas phase; switching reaction(Cl- HCl)SO2; M |
Quantity | Value | Units | Method | Reference | Comment |
ΔrS° | 85.4 | J/mol*K | PHPMS | Caldwell and Kebarle, 1985 | gas phase; switching reaction(Cl- HCl)SO2; M |
ΔrS° | 102. | J/mol*K | PHPMS | Yamdagni and Kebarle, 1974 | gas phase; M |
Quantity | Value | Units | Method | Reference | Comment |
ΔrG° | 33.1 ± 0.84 | kJ/mol | TDAs | Yamdagni and Kebarle, 1974 | gas phase; B |
By formula: I- + HCl = (I- • HCl)
Bond type: Hydrogen bond (negative ion to hydride)
Quantity | Value | Units | Method | Reference | Comment |
---|---|---|---|---|---|
ΔrH° | 61.9 ± 8.4 | kJ/mol | TDAs | Caldwell and Kebarle, 1985 | gas phase; B,M |
ΔrH° | 59.4 | kJ/mol | HPMS | Keesee, Lee, et al., 1980 | gas phase; M |
Quantity | Value | Units | Method | Reference | Comment |
ΔrS° | 83.7 | J/mol*K | PHPMS | Caldwell and Kebarle, 1985 | gas phase; M |
ΔrS° | 95.0 | J/mol*K | HPMS | Keesee, Lee, et al., 1980 | gas phase; M |
Quantity | Value | Units | Method | Reference | Comment |
ΔrG° | 37. ± 11. | kJ/mol | TDAs | Caldwell and Kebarle, 1985 | gas phase; B |
By formula: HO4S- + HCl = (HO4S- • HCl)
Quantity | Value | Units | Method | Reference | Comment |
---|---|---|---|---|---|
ΔrH° | 65.7 ± 4.2 | kJ/mol | TDEq | Bohringer, Fahey, et al., 1984 | gas phase; Relative to HOH..HSO4-, Bohringer, Fahey, et al., 1984; B,M |
Quantity | Value | Units | Method | Reference | Comment |
ΔrS° | 63.2 | J/mol*K | N/A | Bohringer, Fahey, et al., 1984 | gas phase; switching reaction(HSO4-)H2O, Entropy change calculated or estimated; M |
Quantity | Value | Units | Method | Reference | Comment |
ΔrG° | 46.9 ± 4.2 | kJ/mol | TDEq | Bohringer, Fahey, et al., 1984 | gas phase; Relative to HOH..HSO4-, Bohringer, Fahey, et al., 1984; B,M |
By formula: (Cl- • HCl • H2O) + HCl = (Cl- • 2HCl • H2O)
Bond type: Hydrogen bond (negative ion to hydride)
Quantity | Value | Units | Method | Reference | Comment |
---|---|---|---|---|---|
ΔrH° | 51.5 | kJ/mol | HPMS | Upschulte, Evans, et al., 1986 | gas phase; From thermochemical cycle,switching reaction(Cl- H2O) HCl, deuterated; Yamdagni and Kebarle, 1974; M |
Quantity | Value | Units | Method | Reference | Comment |
ΔrS° | 87.4 | J/mol*K | HPMS | Upschulte, Evans, et al., 1986 | gas phase; From thermochemical cycle,switching reaction(Cl- H2O) HCl, deuterated; Yamdagni and Kebarle, 1974; M |
By formula: (Cl- • 2H2O) + HCl = (Cl- • HCl • 2H2O)
Bond type: Hydrogen bond (negative ion to hydride)
Quantity | Value | Units | Method | Reference | Comment |
---|---|---|---|---|---|
ΔrH° | 54.4 | kJ/mol | HPMS | Upschulte, Evans, et al., 1986 | gas phase; From thermochemical cycle(Cl- 2H2O)H2O, deuterated; Keesee and Castleman, 1980; M |
Quantity | Value | Units | Method | Reference | Comment |
ΔrS° | 90.8 | J/mol*K | HPMS | Upschulte, Evans, et al., 1986 | gas phase; From thermochemical cycle(Cl- 2H2O)H2O, deuterated; Keesee and Castleman, 1980; M |
By formula: (Br- • O2S) + HCl = (Br- • HCl • O2S)
Bond type: Hydrogen bond (negative ion to hydride)
Quantity | Value | Units | Method | Reference | Comment |
---|---|---|---|---|---|
ΔrH° | 93.7 | kJ/mol | PHPMS | Caldwell and Kebarle, 1985 | gas phase; From thermochemical cycle,switching reaction(Br-)SO2; M |
Quantity | Value | Units | Method | Reference | Comment |
ΔrS° | 77.8 | J/mol*K | PHPMS | Caldwell and Kebarle, 1985 | gas phase; From thermochemical cycle,switching reaction(Br-)SO2; M |
By formula: Br- + HCl = (Br- • HCl)
Bond type: Hydrogen bond (negative ion to hydride)
Quantity | Value | Units | Method | Reference | Comment |
---|---|---|---|---|---|
ΔrH° | 82.0 ± 8.4 | kJ/mol | TDEq | Caldwell and Kebarle, 1985 | gas phase; B,M |
Quantity | Value | Units | Method | Reference | Comment |
ΔrS° | 92.0 | J/mol*K | PHPMS | Caldwell and Kebarle, 1985 | gas phase; switching reaction(Br-)SO2; M |
Quantity | Value | Units | Method | Reference | Comment |
ΔrG° | 54. ± 11. | kJ/mol | TDEq | Caldwell and Kebarle, 1985 | gas phase; B |
By formula: (Cl- • 2HCl) + HCl = (Cl- • 3HCl)
Bond type: Hydrogen bond (negative ion to hydride)
Quantity | Value | Units | Method | Reference | Comment |
---|---|---|---|---|---|
ΔrH° | 49.0 ± 1.3 | kJ/mol | TDAs | Yamdagni and Kebarle, 1974 | gas phase; B,M |
Quantity | Value | Units | Method | Reference | Comment |
ΔrS° | 97.9 | J/mol*K | PHPMS | Yamdagni and Kebarle, 1974 | gas phase; M |
Quantity | Value | Units | Method | Reference | Comment |
ΔrG° | 19.7 ± 1.3 | kJ/mol | TDAs | Yamdagni and Kebarle, 1974 | gas phase; B |
By formula: (Cl- • 3HCl) + HCl = (Cl- • 4HCl)
Bond type: Hydrogen bond (negative ion to hydride)
Quantity | Value | Units | Method | Reference | Comment |
---|---|---|---|---|---|
ΔrH° | 43.1 ± 2.9 | kJ/mol | TDAs | Yamdagni and Kebarle, 1974 | gas phase; B,M |
Quantity | Value | Units | Method | Reference | Comment |
ΔrS° | 112. | J/mol*K | PHPMS | Yamdagni and Kebarle, 1974 | gas phase; M |
Quantity | Value | Units | Method | Reference | Comment |
ΔrG° | 9.6 ± 4.2 | kJ/mol | TDAs | Yamdagni and Kebarle, 1974 | gas phase; B |
By formula: (Cl- • 2HCl) + H2O = (Cl- • H2O • 2HCl)
Bond type: Hydrogen bond (negative ion to hydride)
Quantity | Value | Units | Method | Reference | Comment |
---|---|---|---|---|---|
ΔrH° | 32. | kJ/mol | HPMS | Upschulte, Evans, et al., 1986 | gas phase; deuterated, quoted in Keesee and Castleman, 1986; M |
Quantity | Value | Units | Method | Reference | Comment |
ΔrS° | 63.6 | J/mol*K | HPMS | Upschulte, Evans, et al., 1986 | gas phase; deuterated, quoted in Keesee and Castleman, 1986; M |
By formula: (Cl- • HCl) + H2O = (Cl- • H2O • HCl)
Bond type: Hydrogen bond (negative ion to hydride)
Quantity | Value | Units | Method | Reference | Comment |
---|---|---|---|---|---|
ΔrH° | 43.9 | kJ/mol | HPMS | Upschulte, Evans, et al., 1986 | gas phase; deuterated, quoted in Keesee and Castleman, 1986; M |
Quantity | Value | Units | Method | Reference | Comment |
ΔrS° | 78.2 | J/mol*K | HPMS | Upschulte, Evans, et al., 1986 | gas phase; deuterated, quoted in Keesee and Castleman, 1986; M |
By formula: C2H3ClO + H2O = C2H4O2 + HCl
Quantity | Value | Units | Method | Reference | Comment |
---|---|---|---|---|---|
ΔrH° | -94.47 | kJ/mol | Cm | Devore and O'Neal, 1969 | liquid phase; Heat of hydrolysis; ALS |
ΔrH° | -92.30 | kJ/mol | Cm | Pritchard and Skinner, 1950 | liquid phase; Heat of hydrolysis at 298 K, see Carson and Skinner, 1949; ALS |
ΔrH° | -92.42 | kJ/mol | Cm | Carson and Skinner, 1949 | liquid phase; ALS |
By formula: (Cl- • H2O • HCl) + H2O = (Cl- • 2H2O • HCl)
Bond type: Hydrogen bond (negative ion to hydride)
Quantity | Value | Units | Method | Reference | Comment |
---|---|---|---|---|---|
ΔrH° | 40. | kJ/mol | HPMS | Upschulte, Evans, et al., 1986 | gas phase; deuterated, quoted in 86 KEE/CAS; M |
Quantity | Value | Units | Method | Reference | Comment |
ΔrS° | 85.4 | J/mol*K | HPMS | Upschulte, Evans, et al., 1986 | gas phase; deuterated, quoted in 86 KEE/CAS; M |
By formula: (Cl- • O2S) + HCl = (Cl- • HCl • O2S)
Bond type: Hydrogen bond (negative ion to hydride)
Quantity | Value | Units | Method | Reference | Comment |
---|---|---|---|---|---|
ΔrH° | 58.2 | kJ/mol | PHPMS | Caldwell and Kebarle, 1985 | gas phase; From thermochemical cycle; M |
Quantity | Value | Units | Method | Reference | Comment |
ΔrS° | 80.3 | J/mol*K | PHPMS | Caldwell and Kebarle, 1985 | gas phase; From thermochemical cycle; M |
By formula: C2H4Cl2 = C2H3Cl + HCl
Quantity | Value | Units | Method | Reference | Comment |
---|---|---|---|---|---|
ΔrH° | 50.6 ± 4.2 | kJ/mol | Cm | Buravtsev, Grigor'ev, et al., 1992 | gas phase; ALS |
ΔrH° | 82.0 | kJ/mol | Eqk | Levanova, Bushneva, et al., 1979 | liquid phase; ALS |
ΔrH° | 68.2 | kJ/mol | Eqk | Levanova, Bushneva, et al., 1979 | gas phase; ALS |
ΔrH° | 67.95 | kJ/mol | Eqk | Ghosh and Guha, 1951 | liquid phase; ALS |
By formula: (Br- • HCl) + HCl = (Br- • 2HCl)
Bond type: Hydrogen bond (negative ion to hydride)
Quantity | Value | Units | Method | Reference | Comment |
---|---|---|---|---|---|
ΔrH° | 52.3 | kJ/mol | PHPMS | Caldwell and Kebarle, 1985 | gas phase; switching reaction(Br-)SO2; M |
Quantity | Value | Units | Method | Reference | Comment |
ΔrS° | 77.0 | J/mol*K | PHPMS | Caldwell and Kebarle, 1985 | gas phase; switching reaction(Br-)SO2; M |
By formula: C2H5Cl = C2H4 + HCl
Quantity | Value | Units | Method | Reference | Comment |
---|---|---|---|---|---|
ΔrH° | 92.0 | kJ/mol | Eqk | Levanova, Bushneva, et al., 1979 | liquid phase; ALS |
ΔrH° | 71.5 | kJ/mol | Eqk | Levanova, Bushneva, et al., 1979 | gas phase; ALS |
ΔrH° | 72.6 ± 2.1 | kJ/mol | Eqk | Howlett, 1955 | gas phase; ALS |
ΔrH° | 71.5 | kJ/mol | Eqk | Lane, Linnett, et al., 1953 | gas phase; ALS |
By formula: C2H3Cl3 = C2H2Cl2 + HCl
Quantity | Value | Units | Method | Reference | Comment |
---|---|---|---|---|---|
ΔrH° | 56.9 | kJ/mol | Eqk | Levanova, Bushneva, et al., 1979 | liquid phase; ALS |
ΔrH° | 49.0 | kJ/mol | Eqk | Levanova, Bushneva, et al., 1979 | gas phase; ALS |
ΔrH° | 56.9 ± 2.1 | kJ/mol | Eqk | Levanova, Treger, et al., 1975 | liquid phase; solvent: Nitrobenzene; Flow reactor at 50°C; ALS |
By formula: H2O + C7H5ClO = C7H6O2 + HCl
Quantity | Value | Units | Method | Reference | Comment |
---|---|---|---|---|---|
ΔrH° | -34.04 ± 0.21 | kJ/mol | Cm | Moselhy and Pritchard, 1975 | liquid phase; solvent: Diphenyl-ether; see Carson, Pritchard, et al., 1950 and Davies, Dunning, et al., 1972; ALS |
ΔrH° | -101.9 | kJ/mol | Cm | Carson, Pritchard, et al., 1950 | liquid phase; Heat of hydrolysis; ALS |
By formula: C3H7Cl = C3H6 + HCl
Quantity | Value | Units | Method | Reference | Comment |
---|---|---|---|---|---|
ΔrH° | 72.4 ± 0.8 | kJ/mol | Eqk | Noren and Sunner, 1970 | gas phase; ALS |
ΔrH° | 73.72 ± 0.63 | kJ/mol | Eqk | Kabo and Andreevskii, 1963 | gas phase; At 415.5 K; ALS |
ΔrH° | 73.0 ± 2.1 | kJ/mol | Eqk | Howlett, 1955 | gas phase; ALS |
By formula: C4H9Cl = C4H8 + HCl
Quantity | Value | Units | Method | Reference | Comment |
---|---|---|---|---|---|
ΔrH° | 74. ± 2. | kJ/mol | Eqk | Howlett, 1955 | gas phase; ALS |
ΔrH° | 74.06 | kJ/mol | Eqk | Howlett, 1951 | gas phase; Hf-gas-(390) -44.4 kcal/mol; ALS |
ΔrH° | 72. ± 2. | kJ/mol | Eqk | Kistiakowsky and Stauffer, 1937 | gas phase; ALS |
By formula: HCl + C9H10 = C9H11Cl
Quantity | Value | Units | Method | Reference | Comment |
---|---|---|---|---|---|
ΔrH° | -36.8 ± 1.9 | kJ/mol | Cm | Arnett and Pienta, 1980 | liquid phase; solvent: Methylene chloride; Hydrochlorination; ALS |
ΔrH° | -51.9 ± 4.6 | kJ/mol | Cm | Nesterova, Kovzel, et al., 1977 | liquid phase; Hydrochlorination; ALS |
By formula: (Cl- • H2O) + HCl = (Cl- • HCl • H2O)
Bond type: Hydrogen bond (negative ion to hydride)
Quantity | Value | Units | Method | Reference | Comment |
---|---|---|---|---|---|
ΔrH° | 66.9 | kJ/mol | HPMS | Upschulte, Evans, et al., 1986 | gas phase; M |
Quantity | Value | Units | Method | Reference | Comment |
ΔrS° | 91.2 | J/mol*K | HPMS | Upschulte, Evans, et al., 1986 | gas phase; M |
By formula: CH3+ + HCl = (CH3+ • HCl)
Quantity | Value | Units | Method | Reference | Comment |
---|---|---|---|---|---|
ΔrH° | 216. | kJ/mol | PHPMS | McMahon, Heinis, et al., 1988 | gas phase; switching reaction(CH3+)N2, Entropy change calculated or estimated, uses MCA(N2) = 202. kJ/mol; Foster, Williamson, et al., 1974; M |
By formula: C3H6Cl2 = C3H5Cl + HCl
Quantity | Value | Units | Method | Reference | Comment |
---|---|---|---|---|---|
ΔrH° | 65.1 | kJ/mol | Eqk | Levanova, Rodova, et al., 1983 | liquid phase; Flow reactor; ALS |
ΔrH° | 59.8 ± 0.8 | kJ/mol | Eqk | Shevtsova, Rozhnov, et al., 1970 | gas phase; Heat of Dehydrochlorination at 392 K; ALS |
By formula: C2H4Cl2 + 2H2 = C2H6 + 2HCl
Quantity | Value | Units | Method | Reference | Comment |
---|---|---|---|---|---|
ΔrH° | -143.0 ± 0.96 | kJ/mol | Chyd | Lacher, Amador, et al., 1967 | gas phase; Reanalyzed by Cox and Pilcher, 1970, Original value = -147.77 ± 0.50 kJ/mol; At 250 C; ALS |
By formula: 2H2 + C3H6Cl2 = C3H8 + 2HCl
Quantity | Value | Units | Method | Reference | Comment |
---|---|---|---|---|---|
ΔrH° | -126.5 ± 1.1 | kJ/mol | Chyd | Lacher, Amador, et al., 1967 | gas phase; Reanalyzed by Cox and Pilcher, 1970, Original value = -130.60 ± 0.54 kJ/mol; At 250 C; ALS |
By formula: 2H2 + CH2Cl2 = CH4 + 2HCl
Quantity | Value | Units | Method | Reference | Comment |
---|---|---|---|---|---|
ΔrH° | -163.4 ± 1.3 | kJ/mol | Chyd | Lacher, Amador, et al., 1967 | gas phase; Reanalyzed by Cox and Pilcher, 1970, Original value = -167.7 ± 1.3 kJ/mol; At 250 C; ALS |
By formula: 2H2 + C2H4Cl2 = C2H6 + 2HCl
Quantity | Value | Units | Method | Reference | Comment |
---|---|---|---|---|---|
ΔrH° | -140.8 ± 1.0 | kJ/mol | Chyd | Lacher, Amador, et al., 1967 | gas phase; Reanalyzed by Cox and Pilcher, 1970, Original value = -145.0 ± 0.50 kJ/mol; At 250C; ALS |
By formula: C4H8Cl2 = C4H7Cl + HCl
Quantity | Value | Units | Method | Reference | Comment |
---|---|---|---|---|---|
ΔrH° | -8.79 ± 0.08 | kJ/mol | Eqk | Levanova, Rozhnov, et al., 1972 | gas phase; At 568 K; ALS |
ΔrH° | 55.2 ± 0.3 | kJ/mol | Eqk | Levanova, Rozhnov, et al., 1972 | gas phase; At 404.5 K; ALS |
By formula: C4H8Cl2 = C4H7Cl + HCl
Quantity | Value | Units | Method | Reference | Comment |
---|---|---|---|---|---|
ΔrH° | -14. ± 0.08 | kJ/mol | Eqk | Levanova, Rozhnov, et al., 1972 | gas phase; At 568 K; ALS |
ΔrH° | 5.0 ± 0.3 | kJ/mol | Eqk | Levanova, Rozhnov, et al., 1972 | gas phase; At 404.5 K; ALS |
By formula: 2H2 + C2ClF3 = C2H3F3 + HCl
Quantity | Value | Units | Method | Reference | Comment |
---|---|---|---|---|---|
ΔrH° | -267.7 ± 2.1 | kJ/mol | Chyd | Lacher, Kianpour, et al., 1956 | gas phase; Reanalyzed by Cox and Pilcher, 1970, Original value = -271.6 kJ/mol; At 410 K; ALS |
By formula: (Cl- • HCl) + O2S = (Cl- • O2S • HCl)
Quantity | Value | Units | Method | Reference | Comment |
---|---|---|---|---|---|
ΔrH° | 51.5 | kJ/mol | PHPMS | Caldwell and Kebarle, 1985 | gas phase; M |
Quantity | Value | Units | Method | Reference | Comment |
ΔrS° | 77.4 | J/mol*K | PHPMS | Caldwell and Kebarle, 1985 | gas phase; M |
By formula: (Br- • HCl) + O2S = (Br- • O2S • HCl)
Quantity | Value | Units | Method | Reference | Comment |
---|---|---|---|---|---|
ΔrH° | 50.6 | kJ/mol | PHPMS | Caldwell and Kebarle, 1985 | gas phase; M |
Quantity | Value | Units | Method | Reference | Comment |
ΔrS° | 77.8 | J/mol*K | PHPMS | Caldwell and Kebarle, 1985 | gas phase; M |
By formula: C4H8Cl2 = C4H7Cl + HCl
Quantity | Value | Units | Method | Reference | Comment |
---|---|---|---|---|---|
ΔrH° | 69.0 | kJ/mol | Eqk | Levanova, Rodova, et al., 1974 | gas phase; ALS |
ΔrH° | 66.53 ± 0.92 | kJ/mol | Eqk | Rodova, Levanova, et al., 1973 | gas phase; At 454 K; ALS |
By formula: C4H9ClO = C4H8O + HCl
Quantity | Value | Units | Method | Reference | Comment |
---|---|---|---|---|---|
ΔrH° | 68.2 ± 2.1 | kJ/mol | Eqk | Failes and Stimson, 1967 | gas phase; Reanalyzed by Cox and Pilcher, 1970, Original value = 69.0 kJ/mol; At 450 K; ALS |
By formula: C2H2Cl4 = HCl + C2HCl3
Quantity | Value | Units | Method | Reference | Comment |
---|---|---|---|---|---|
ΔrH° | 43.9 | kJ/mol | Eqk | Levanova, Bushneva, et al., 1979 | gas phase; ALS |
ΔrH° | 45.40 | kJ/mol | Eqk | Levanova, Bushneva, et al., 1976 | liquid phase; At 333 K; ALS |
By formula: C2HCl5 = C2Cl4 + HCl
Quantity | Value | Units | Method | Reference | Comment |
---|---|---|---|---|---|
ΔrH° | 45.1 ± 4.5 | kJ/mol | Eqk | Levanova, Bushneva, et al., 1979 | liquid phase; GC; ALS |
ΔrH° | 39. | kJ/mol | Eqk | Levanova, Bushneva, et al., 1979 | gas phase; ALS |
2 (g) +
(l) = AlCl3 (cr) + 2
(g)
By formula: 2HCl (g) + C4H10AlCl (l) = AlCl3 (cr) + 2C2H6 (g)
Quantity | Value | Units | Method | Reference | Comment |
---|---|---|---|---|---|
ΔrH° | -265.0 ± 3.3 | kJ/mol | RSC | Shaulov and Shmyreva, 1968 | The reaction enthalpy was derived from data in Shaulov and Shmyreva, 1968.; MS |
By formula: C5H10Cl2 = C5H9Cl + HCl
Quantity | Value | Units | Method | Reference | Comment |
---|---|---|---|---|---|
ΔrH° | 68. ± 1. | kJ/mol | Eqk | Meged, Levanova, et al., 1980 | gas phase; ALS |
ΔrH° | 68.2 ± 4.2 | kJ/mol | Eqk | Meged, Levanova, et al., 1980 | gas phase; ALS |
By formula: F- + HCl = (F- • HCl)
Bond type: Hydrogen bond (negative ion to hydride)
Quantity | Value | Units | Method | Reference | Comment |
---|---|---|---|---|---|
ΔrH° | 250. ± 8. | kJ/mol | ICR | Larson and McMahon, 1985 | gas phase; bracketing; M |
By formula: C4H8Cl2 = C4H7Cl + HCl
Quantity | Value | Units | Method | Reference | Comment |
---|---|---|---|---|---|
ΔrH° | 61.1 | kJ/mol | Eqk | Levanova, Rodova, et al., 1974 | gas phase; ALS |
ΔrH° | 61.1 ± 0.4 | kJ/mol | Eqk | Rodova, Shevtsova, et al., 1974 | gas phase; ALS |
By formula: Na+ + HCl = (Na+ • HCl)
Quantity | Value | Units | Method | Reference | Comment |
---|---|---|---|---|---|
ΔrH° | 51.0 | kJ/mol | FA | Perry, Rowe, et al., 1980 | gas phase; M |
Quantity | Value | Units | Method | Reference | Comment |
ΔrS° | 85.4 | J/mol*K | FA | Perry, Rowe, et al., 1980 | gas phase; M |
By formula: C2H4Cl2 = C2H3Cl + HCl
Quantity | Value | Units | Method | Reference | Comment |
---|---|---|---|---|---|
ΔrH° | 74.5 | kJ/mol | Eqk | Levanova, Bushneva, et al., 1979 | liquid phase; ALS |
ΔrH° | 61.9 | kJ/mol | Eqk | Levanova, Bushneva, et al., 1979 | gas phase; ALS |
By formula: C2H3Cl3 = C2H2Cl2 + HCl
Quantity | Value | Units | Method | Reference | Comment |
---|---|---|---|---|---|
ΔrH° | 51.5 | kJ/mol | Eqk | Levanova, Bushneva, et al., 1979 | gas phase; ALS |
ΔrH° | 65.3 | kJ/mol | Eqk | Levanova, Bushneva, et al., 1979 | liquid phase; ALS |
By formula: C2H2Cl4 = HCl + C2HCl3
Quantity | Value | Units | Method | Reference | Comment |
---|---|---|---|---|---|
ΔrH° | 55.2 | kJ/mol | Eqk | Levanova, Bushneva, et al., 1979 | liquid phase; ALS |
ΔrH° | 44.8 | kJ/mol | Eqk | Levanova, Bushneva, et al., 1979 | gas phase; ALS |
C30H28Fe2Ti (cr) + 2( • 4.40
) (solution) = 2
(cr) +
(cr)
By formula: C30H28Fe2Ti (cr) + 2(HCl • 4.40H2O) (solution) = 2C10H10Fe (cr) + C10H10Cl2Ti (cr)
Quantity | Value | Units | Method | Reference | Comment |
---|---|---|---|---|---|
ΔrH° | -253.5 ± 4.5 | kJ/mol | RSC | Dias, Salema, et al., 1982 | Please also see Calhorda, Dias, et al., 1987.; MS |
By formula: C7H4Cl2O + H2O = C7H5ClO2 + HCl
Quantity | Value | Units | Method | Reference | Comment |
---|---|---|---|---|---|
ΔrH° | -39.8 ± 0.3 | kJ/mol | Cm | Moselhy and Pritchard, 1975 | liquid phase; solvent: Diphenyl-ether; Heat of hydrolysis; ALS |

Henry's Law data

Data compiled by: Rolf Sander
Henry's Law constant (water solution)
kH(T) = k°H exp(d(ln(kH))/d(1/T) ((1/T) - 1/(298.15 K)))
k°H = Henry's law constant for solubility in water at 298.15 K (mol/(kg*bar))
d(ln(kH))/d(1/T) = Temperature dependence constant (K)
k°H (mol/(kg*bar)) | d(ln(kH))/d(1/T) (K) | Method | Reference | Comment |
---|---|---|---|---|
19. | 600. | Q | N/A | Only the tabulated data between T = 273. K and T = 303. K from missing citation was used to derive kH and -Δ kH/R. Above T = 303. K the tabulated data could not be parameterized by equation (reference missing) very well. The partial pressure of water vapor (needed to convert some Henry's law constants) was calculated using the formula given by missing citation. The quantities A and α from missing citation were assumed to be identical. |
2.0×10+6/KA | 9000. | T | N/A | For strong acids, the solubility is often expressed as kH = ([H+] * [A-]) / p(HA). To obtain the physical solubility of HA, the value has to be divided by the acidity constant KA. missing citation corrects erroneous data from missing citation. |
2500. | Q | N/A | Several references are given in the list of Henry's law constants but not assigned to specific species. | |
1.1 | 2000. | T | N/A | |
20. | C | N/A | ||
2.0×10+6/KA | 9000. | T | N/A | |
1500. | X | N/A | The value is taken from the compilation of solubilities by W. Asman (unpublished). | |
19. | 9000. | X | N/A | The value is taken from the compilation of solubilities by W. Asman (unpublished). |
170000./KA | X | N/A | The value is taken from the compilation of solubilities by W. Asman (unpublished). For strong acids, the solubility is often expressed as kH = ([H+] * [A-]) / p(HA). To obtain the physical solubility of HA, the value has to be divided by the acidity constant KA. |

Phase change data

Data compiled as indicated in comments:
TRC - Thermodynamics Research Center, NIST Boulder Laboratories, Chris Muzny director
AC - William E. Acree, Jr., James S. Chickos
Quantity | Value | Units | Method | Reference | Comment |
---|---|---|---|---|---|
Tfus | 161.15 | K | N/A | Beckmann and Waentig, 1910 | Uncertainty assigned by TRC = 2. K; TRC |
Quantity | Value | Units | Method | Reference | Comment |
Ptriple | 0.13620 | atm | N/A | Henderson, Lewis, et al., 1986 | Uncertainty assigned by TRC = 0.00006 atm; TRC |
Quantity | Value | Units | Method | Reference | Comment |
Tc | 324.68 | K | N/A | Henderson, Lewis, et al., 1986 | Uncertainty assigned by TRC = 0.03 K; TRC |
Quantity | Value | Units | Method | Reference | Comment |
Pc | 81.48 | atm | N/A | Henderson, Lewis, et al., 1986 | Uncertainty assigned by TRC = 0.0813 atm; VP measured up to 219 K and Pc determined from fitted Wagner equation; TRC |
Enthalpy of vaporization
ΔvapH (kcal/mol) | Temperature (K) | Method | Reference | Comment |
---|---|---|---|---|
3.87 | 188. | C | Giauque and Wiebe, 1928 | AC |
Antoine Equation Parameters
log10(P) = A − (B / (T + C))
P = vapor pressure (atm)
T = temperature (K)
View plot Requires a JavaScript / HTML 5 canvas capable browser.
Temperature (K) | A | B | C | Reference | Comment |
---|---|---|---|---|---|
122.3 to 188.3 | 3.60194 | 535.172 | -39.847 | Stull, 1947 | Coefficents calculated by NIST from author's data. |
188.3 to 309.4 | 4.56818 | 868.358 | 1.754 | Stull, 1947 | Coefficents calculated by NIST from author's data. |
Enthalpy of sublimation
ΔsubH (kcal/mol) | Temperature (K) | Reference | Comment |
---|---|---|---|
4.71 | 127. | Ser and Larher, 1990 | Based on data from 121. to 133. K.; AC |
4.68 | 142. | Ser and Larher, 1990 | Based on data from 134. to 150. K.; AC |

Gas phase ion energetics data

Data evaluated as indicated in comments:
HL - Edward P. Hunter and Sharon G. Lias
L - Sharon G. Lias
Data compiled as indicated in comments:
B - John E. Bartmess
LBLHLM - Sharon G. Lias, John E. Bartmess, Joel F. Liebman, John L. Holmes, Rhoda D. Levin, and W. Gary Mallard
LLK - Sharon G. Lias, Rhoda D. Levin, and Sherif A. Kafafi
RDSH - Henry M. Rosenstock, Keith Draxl, Bruce W. Steiner, and John T. Herron
Quantity | Value | Units | Method | Reference | Comment |
---|---|---|---|---|---|
IE (evaluated) | 12.744 ± 0.009 | eV | N/A | N/A | L |
Quantity | Value | Units | Method | Reference | Comment |
Proton affinity (review) | 133.1 | kcal/mol | N/A | Hunter and Lias, 1998 | HL |
Quantity | Value | Units | Method | Reference | Comment |
Gas basicity | 126.7 | kcal/mol | N/A | Hunter and Lias, 1998 | HL |
Ionization energy determinations
IE (eV) | Method | Reference | Comment |
---|---|---|---|
12.790 | PE | Wang, Dillon, et al., 1984 | LBLHLM |
12.752 ± 0.006 | PE | Pennetreau, Natalis, et al., 1983 | LBLHLM |
12.748 | PE | Von Niessen, Asbrink, et al., 1982 | LBLHLM |
12.747 ± 0.002 | PE | Natalis, Pennetreau, et al., 1982 | LBLHLM |
12.75 | PE | Kimura, Katsumata, et al., 1981 | LLK |
12.72 ± 0.03 | PI | Tiedemann, Anderson, et al., 1979 | LLK |
12.748 | EVAL | Huber and Herzberg, 1979 | LLK |
12.748 ± 0.005 | PE | Weiss, Lawrence, et al., 1970 | RDSH |
12.74 ± 0.01 | PE | Lempka, Passmore, et al., 1968 | RDSH |
12.742 ± 0.010 | PI | Nicholson, 1965 | RDSH |
12.74 ± 0.01 | PI | Watanabe, 1957 | RDSH |
Appearance energy determinations
Ion | AE (eV) | Other Products | Method | Reference | Comment |
---|---|---|---|---|---|
Cl+ | 17.34 ± 0.01 | H | PI | Krauss, Walker, et al., 1968 | RDSH |
H+ | 14.5 | Cl- | EI | Fox, 1957 | RDSH |
De-protonation reactions
Quantity | Value | Units | Method | Reference | Comment |
---|---|---|---|---|---|
ΔrH° | 333.40 | kcal/mol | N/A | Martin and Hepburn, 1998 | gas phase; Given: ΔHacid(0K)=116288.7±0.6 cm-1, or 332.486±0.002 kcal/mol; B |
ΔrH° | 333.6 ± 2.1 | kcal/mol | G+TS | Fujio, McIver, et al., 1981 | gas phase; value altered from reference due to change in acidity scale; B |
ΔrH° | 329.10 | kcal/mol | N/A | Check, Faust, et al., 2001 | gas phase; FeCC-(q); ; ΔS(EA)=5.0; B |
Quantity | Value | Units | Method | Reference | Comment |
ΔrG° | 328.10 ± 0.10 | kcal/mol | H-TS | Martin and Hepburn, 1998 | gas phase; Given: ΔHacid(0K)=116288.7±0.6 cm-1, or 332.486±0.002 kcal/mol; B |
ΔrG° | 328.3 ± 2.0 | kcal/mol | IMRE | Fujio, McIver, et al., 1981 | gas phase; value altered from reference due to change in acidity scale; B |
ΔrG° | 323.70 | kcal/mol | N/A | Check, Faust, et al., 2001 | gas phase; FeCC-(q); ; ΔS(EA)=5.0; B |

Ion clustering data

Data compiled as indicated in comments:
B - John E. Bartmess
M - Michael M. Meot-Ner (Mautner) and Sharon G. Lias
Clustering reactions
By formula: Br- + HCl = (Br- • HCl)
Bond type: Hydrogen bond (negative ion to hydride)
Quantity | Value | Units | Method | Reference | Comment |
---|---|---|---|---|---|
ΔrH° | 19.6 ± 2.0 | kcal/mol | TDEq | Caldwell and Kebarle, 1985 | gas phase; B,M |
Quantity | Value | Units | Method | Reference | Comment |
ΔrS° | 22.0 | cal/mol*K | PHPMS | Caldwell and Kebarle, 1985 | gas phase; switching reaction(Br-)SO2; M |
Quantity | Value | Units | Method | Reference | Comment |
ΔrG° | 13.0 ± 2.6 | kcal/mol | TDEq | Caldwell and Kebarle, 1985 | gas phase; B |
By formula: (Br- • HCl) + HCl = (Br- • 2HCl)
Bond type: Hydrogen bond (negative ion to hydride)
Quantity | Value | Units | Method | Reference | Comment |
---|---|---|---|---|---|
ΔrH° | 12.5 | kcal/mol | PHPMS | Caldwell and Kebarle, 1985 | gas phase; switching reaction(Br-)SO2; M |
Quantity | Value | Units | Method | Reference | Comment |
ΔrS° | 18.4 | cal/mol*K | PHPMS | Caldwell and Kebarle, 1985 | gas phase; switching reaction(Br-)SO2; M |
By formula: (Br- • O2S) + HCl = (Br- • HCl • O2S)
Bond type: Hydrogen bond (negative ion to hydride)
Quantity | Value | Units | Method | Reference | Comment |
---|---|---|---|---|---|
ΔrH° | 22.4 | kcal/mol | PHPMS | Caldwell and Kebarle, 1985 | gas phase; From thermochemical cycle,switching reaction(Br-)SO2; M |
Quantity | Value | Units | Method | Reference | Comment |
ΔrS° | 18.6 | cal/mol*K | PHPMS | Caldwell and Kebarle, 1985 | gas phase; From thermochemical cycle,switching reaction(Br-)SO2; M |
By formula: CH3+ + HCl = (CH3+ • HCl)
Quantity | Value | Units | Method | Reference | Comment |
---|---|---|---|---|---|
ΔrH° | 51.7 | kcal/mol | PHPMS | McMahon, Heinis, et al., 1988 | gas phase; switching reaction(CH3+)N2, Entropy change calculated or estimated, uses MCA(N2) = 48.3 kcal/mol; Foster, Williamson, et al., 1974; M |
By formula: C6H6+ + HCl = (C6H6+ • HCl)
Quantity | Value | Units | Method | Reference | Comment |
---|---|---|---|---|---|
ΔrH° | 7.3 | kcal/mol | PI | Walters, Grover, et al., 1985 | gas phase; M |
By formula: Cl- + HCl = (Cl- • HCl)
Bond type: Hydrogen bond (negative ion to hydride)
Quantity | Value | Units | Method | Reference | Comment |
---|---|---|---|---|---|
ΔrH° | 29.6 ± 1.0 | kcal/mol | N/A | Metz, Kitsopoulos, et al., 1988 | gas phase; Affinity: shift in apparent EA from lesser-solvated ion. Ignores any neutral-neutral bond.; B |
ΔrH° | 23.8 ± 2.0 | kcal/mol | TDEq | Caldwell and Kebarle, 1985 | gas phase; B,M |
ΔrH° | 23.1 ± 2.0 | kcal/mol | IMRE | Larson and McMahon, 1984 | gas phase; B,M |
ΔrH° | 23.70 ± 0.20 | kcal/mol | TDAs | Yamdagni and Kebarle, 1974 | gas phase; B,M |
ΔrH° | 20.4 | kcal/mol | HPMS | Upschulte, Evans, et al., 1986 | gas phase; From thermochemical cycle(Cl-)H2O/HCl, Entropy change calculated or estimated; Keesee and Castleman, 1980; M |
Quantity | Value | Units | Method | Reference | Comment |
ΔrS° | 22.3 | cal/mol*K | PHPMS | Caldwell and Kebarle, 1985 | gas phase; switching reaction(Cl-)SO2; M |
ΔrS° | 23.5 | cal/mol*K | PHPMS | Yamdagni and Kebarle, 1974 | gas phase; M |
ΔrS° | 23.5 | cal/mol*K | N/A | Larson and McMahon, 1984, 2 | gas phase; switching reaction(Cl-)t-C4H9OH, Entropy change calculated or estimated; French, Ikuta, et al., 1982; M |
ΔrS° | 22.8 | cal/mol*K | N/A | Upschulte, Evans, et al., 1986 | gas phase; From thermochemical cycle(Cl-)H2O/HCl, Entropy change calculated or estimated; Keesee and Castleman, 1980; M |
Quantity | Value | Units | Method | Reference | Comment |
ΔrG° | 16.3 ± 2.0 | kcal/mol | IMRE | Larson and McMahon, 1987 | gas phase; K = 0.60 for HCl..Cl- + DCL <=> DCl..Cl- + HCl, anchored to Larson and McMahon, 1984, 32; B |
ΔrG° | 17.1 ± 2.6 | kcal/mol | TDEq | Caldwell and Kebarle, 1985 | gas phase; B |
ΔrG° | 16.0 ± 2.0 | kcal/mol | IMRE | Larson and McMahon, 1984 | gas phase; B,M |
ΔrG° | 16.70 ± 0.30 | kcal/mol | TDAs | Yamdagni and Kebarle, 1974 | gas phase; B |
ΔrG° | 13.6 | kcal/mol | HPMS | Upschulte, Evans, et al., 1986 | gas phase; From thermochemical cycle(Cl-)H2O/HCl, Entropy change calculated or estimated; Keesee and Castleman, 1980; M |
By formula: (Cl- • HCl) + HCl = (Cl- • 2HCl)
Bond type: Hydrogen bond (negative ion to hydride)
Quantity | Value | Units | Method | Reference | Comment |
---|---|---|---|---|---|
ΔrH° | 15.20 ± 0.20 | kcal/mol | TDAs | Yamdagni and Kebarle, 1974 | gas phase; B,M |
ΔrH° | 14.0 | kcal/mol | PHPMS | Caldwell and Kebarle, 1985 | gas phase; switching reaction(Cl- HCl)SO2; M |
Quantity | Value | Units | Method | Reference | Comment |
ΔrS° | 20.4 | cal/mol*K | PHPMS | Caldwell and Kebarle, 1985 | gas phase; switching reaction(Cl- HCl)SO2; M |
ΔrS° | 24.4 | cal/mol*K | PHPMS | Yamdagni and Kebarle, 1974 | gas phase; M |
Quantity | Value | Units | Method | Reference | Comment |
ΔrG° | 7.90 ± 0.20 | kcal/mol | TDAs | Yamdagni and Kebarle, 1974 | gas phase; B |
By formula: (Cl- • 2HCl) + HCl = (Cl- • 3HCl)
Bond type: Hydrogen bond (negative ion to hydride)
Quantity | Value | Units | Method | Reference | Comment |
---|---|---|---|---|---|
ΔrH° | 11.70 ± 0.30 | kcal/mol | TDAs | Yamdagni and Kebarle, 1974 | gas phase; B,M |
Quantity | Value | Units | Method | Reference | Comment |
ΔrS° | 23.4 | cal/mol*K | PHPMS | Yamdagni and Kebarle, 1974 | gas phase; M |
Quantity | Value | Units | Method | Reference | Comment |
ΔrG° | 4.70 ± 0.30 | kcal/mol | TDAs | Yamdagni and Kebarle, 1974 | gas phase; B |
By formula: (Cl- • 3HCl) + HCl = (Cl- • 4HCl)
Bond type: Hydrogen bond (negative ion to hydride)
Quantity | Value | Units | Method | Reference | Comment |
---|---|---|---|---|---|
ΔrH° | 10.30 ± 0.70 | kcal/mol | TDAs | Yamdagni and Kebarle, 1974 | gas phase; B,M |
Quantity | Value | Units | Method | Reference | Comment |
ΔrS° | 26.7 | cal/mol*K | PHPMS | Yamdagni and Kebarle, 1974 | gas phase; M |
Quantity | Value | Units | Method | Reference | Comment |
ΔrG° | 2.3 ± 1.0 | kcal/mol | TDAs | Yamdagni and Kebarle, 1974 | gas phase; B |
By formula: (Cl- • HCl • H2O) + HCl = (Cl- • 2HCl • H2O)
Bond type: Hydrogen bond (negative ion to hydride)
Quantity | Value | Units | Method | Reference | Comment |
---|---|---|---|---|---|
ΔrH° | 12.3 | kcal/mol | HPMS | Upschulte, Evans, et al., 1986 | gas phase; From thermochemical cycle,switching reaction(Cl- H2O) HCl, deuterated; Yamdagni and Kebarle, 1974; M |
Quantity | Value | Units | Method | Reference | Comment |
ΔrS° | 20.9 | cal/mol*K | HPMS | Upschulte, Evans, et al., 1986 | gas phase; From thermochemical cycle,switching reaction(Cl- H2O) HCl, deuterated; Yamdagni and Kebarle, 1974; M |
By formula: (Cl- • H2O) + HCl = (Cl- • HCl • H2O)
Bond type: Hydrogen bond (negative ion to hydride)
Quantity | Value | Units | Method | Reference | Comment |
---|---|---|---|---|---|
ΔrH° | 16.0 | kcal/mol | HPMS | Upschulte, Evans, et al., 1986 | gas phase; M |
Quantity | Value | Units | Method | Reference | Comment |
ΔrS° | 21.8 | cal/mol*K | HPMS | Upschulte, Evans, et al., 1986 | gas phase; M |
By formula: (Cl- • 2H2O) + HCl = (Cl- • HCl • 2H2O)
Bond type: Hydrogen bond (negative ion to hydride)
Quantity | Value | Units | Method | Reference | Comment |
---|---|---|---|---|---|
ΔrH° | 13.0 | kcal/mol | HPMS | Upschulte, Evans, et al., 1986 | gas phase; From thermochemical cycle(Cl- 2H2O)H2O, deuterated; Keesee and Castleman, 1980; M |
Quantity | Value | Units | Method | Reference | Comment |
ΔrS° | 21.7 | cal/mol*K | HPMS | Upschulte, Evans, et al., 1986 | gas phase; From thermochemical cycle(Cl- 2H2O)H2O, deuterated; Keesee and Castleman, 1980; M |
By formula: (Cl- • O2S) + HCl = (Cl- • HCl • O2S)
Bond type: Hydrogen bond (negative ion to hydride)
Quantity | Value | Units | Method | Reference | Comment |
---|---|---|---|---|---|
ΔrH° | 13.9 | kcal/mol | PHPMS | Caldwell and Kebarle, 1985 | gas phase; From thermochemical cycle; M |
Quantity | Value | Units | Method | Reference | Comment |
ΔrS° | 19.2 | cal/mol*K | PHPMS | Caldwell and Kebarle, 1985 | gas phase; From thermochemical cycle; M |
By formula: F- + HCl = (F- • HCl)
Bond type: Hydrogen bond (negative ion to hydride)
Quantity | Value | Units | Method | Reference | Comment |
---|---|---|---|---|---|
ΔrH° | 60. ± 2. | kcal/mol | ICR | Larson and McMahon, 1985 | gas phase; bracketing; M |
By formula: HCl+ + HCl = (HCl+ • HCl)
Quantity | Value | Units | Method | Reference | Comment |
---|---|---|---|---|---|
ΔrH° | 20. | kcal/mol | PI | Tiedemann, Anderson, et al., 1979 | gas phase; M |
By formula: HO4S- + HCl = (HO4S- • HCl)
Quantity | Value | Units | Method | Reference | Comment |
---|---|---|---|---|---|
ΔrH° | 15.7 ± 1.0 | kcal/mol | TDEq | Bohringer, Fahey, et al., 1984 | gas phase; Relative to HOH..HSO4-, Bohringer, Fahey, et al., 1984; B,M |
Quantity | Value | Units | Method | Reference | Comment |
ΔrS° | 15.1 | cal/mol*K | N/A | Bohringer, Fahey, et al., 1984 | gas phase; switching reaction(HSO4-)H2O, Entropy change calculated or estimated; M |
Quantity | Value | Units | Method | Reference | Comment |
ΔrG° | 11.2 ± 1.0 | kcal/mol | TDEq | Bohringer, Fahey, et al., 1984 | gas phase; Relative to HOH..HSO4-, Bohringer, Fahey, et al., 1984; B,M |
By formula: I- + HCl = (I- • HCl)
Bond type: Hydrogen bond (negative ion to hydride)
Quantity | Value | Units | Method | Reference | Comment |
---|---|---|---|---|---|
ΔrH° | 14.8 ± 2.0 | kcal/mol | TDAs | Caldwell and Kebarle, 1985 | gas phase; B,M |
ΔrH° | 14.2 | kcal/mol | HPMS | Keesee, Lee, et al., 1980 | gas phase; M |
Quantity | Value | Units | Method | Reference | Comment |
ΔrS° | 20.0 | cal/mol*K | PHPMS | Caldwell and Kebarle, 1985 | gas phase; M |
ΔrS° | 22.7 | cal/mol*K | HPMS | Keesee, Lee, et al., 1980 | gas phase; M |
Quantity | Value | Units | Method | Reference | Comment |
ΔrG° | 8.8 ± 2.6 | kcal/mol | TDAs | Caldwell and Kebarle, 1985 | gas phase; B |
By formula: Na+ + HCl = (Na+ • HCl)
Quantity | Value | Units | Method | Reference | Comment |
---|---|---|---|---|---|
ΔrH° | 12.2 | kcal/mol | FA | Perry, Rowe, et al., 1980 | gas phase; M |
Quantity | Value | Units | Method | Reference | Comment |
ΔrS° | 20.4 | cal/mol*K | FA | Perry, Rowe, et al., 1980 | gas phase; M |

References

Cox, Wagman, et al., 1984
Cox, J.D.; Wagman, D.D.; Medvedev, V.A.,
CODATA Key Values for Thermodynamics, Hemisphere Publishing Corp., New York, 1984, 1. [all data]
Chase, 1998
Chase, M.W., Jr.,
NIST-JANAF Themochemical Tables, Fourth Edition,
J. Phys. Chem. Ref. Data, Monograph 9, 1998, 1-1951. [all data]
Metz, Kitsopoulos, et al., 1988
Metz, R.B.; Kitsopoulos, T.; Weaver, A.; Neumark, D.M.,
Study of the Transition State Region in the Cl+HCl Reaction by Photoelectron Spectroscopy of ClHCl-,
J. Chem. Phys., 1988, 88, 2, 1463, https://doi.org/10.1063/1.454218
. [all data]
Caldwell and Kebarle, 1985
Caldwell, G.; Kebarle, P.,
The hydrogen bond energies of the bihalide ions XHX- and YHX-,
Can. J. Chem., 1985, 63, 1399. [all data]
Larson and McMahon, 1984
Larson, J.W.; McMahon, T.B.,
Hydrogen bonding in gas phase anions. An experimental investigation of the interaction between chloride ion and bronsted acids from ICR chloride exchange equilibria,
J. Am. Chem. Soc., 1984, 106, 517. [all data]
Yamdagni and Kebarle, 1974
Yamdagni, R.; Kebarle, P.,
The hydrogen bond energies in ClHCl- and Cl-(HCl)n,
Can. J. Chem., 1974, 52, 2449. [all data]
Upschulte, Evans, et al., 1986
Upschulte, B.L.; Evans, D.H.; Keesee, R.G.; Castleman, A.W.,
Unpublished results, referred to in Keesee and Castleman, 1986, 1986. [all data]
Keesee and Castleman, 1980
Keesee, R.G.; Castleman, A.W., Jr.,
Gas phase studies of hydration complexes of Cl- and I- and comparison to electrostatic calculations in the gas phase,
Chem. Phys. Lett., 1980, 74, 139. [all data]
Larson and McMahon, 1984, 2
Larson, J.W.; McMahon, T.B.,
Gas phase negative ion chemistry of alkylchloroformates,
Can. J. Chem., 1984, 62, 675. [all data]
French, Ikuta, et al., 1982
French, M.A.; Ikuta, S.; Kebarle, P.,
Hydrogen bonding of O-H and C-H hydrogen donors to Cl-. Results from mass spectrometric measurement of the ion-molecule equilibria RH + Cl- = RHCl-,
Can. J. Chem., 1982, 60, 1907. [all data]
Larson and McMahon, 1987
Larson, J.W.; McMahon, T.B.,
Isotope Effects in Proton Transfer Reactions. An Ion Cyclotron Resonance Determination of the Equilibrium Deuterium Isotope Effect in the Bichloride Ion,
J. Phys. Chem., 1987, 91, 3, 554, https://doi.org/10.1021/j100287a013
. [all data]
Larson and McMahon, 1984, 3
Larson, J.W.; McMahon, T.B.,
Fluoride and chloride affinities of main group oxides, fluorides, oxofluorides, and alkyls. Quantitative scales of lewis acidities from ion cyclotron resonance halide-exchange equilibria,
J. Phys. Chem., 1984, 88, 1083. [all data]
Martin and Hepburn, 1998
Martin, J.D.D.; Hepburn, J.W.,
Determination of bond dissociation energies by threshold ion-pair production spectroscopy: An improved D-0(HCl),
J. Chem. Phys., 1998, 109, 19, 8139-8142, https://doi.org/10.1063/1.477476
. [all data]
Fujio, McIver, et al., 1981
Fujio, M.; McIver, R.T., Jr.; Taft, R.W.,
Effects on the acidities of phenols from specific substituent-solvent interactions. Inherent substituent parameters from gas phase acidities,
J. Am. Chem. Soc., 1981, 103, 4017. [all data]
Check, Faust, et al., 2001
Check, C.E.; Faust, T.O.; Bailey, J.M.; Wright, B.J.; Gilbert, T.M.; Sunderlin, L.S.,
Addition of Polarization and Diffuse Functions to the LANL2DZ Basis Set for P-Block Elements,
J. Phys. Chem. A,, 2001, 105, 34, 8111, https://doi.org/10.1021/jp011945l
. [all data]
Keesee, Lee, et al., 1980
Keesee, R.G.; Lee, N.; Castleman, A.W., Jr.,
Properties of clusters in the gas phase: V. Complexes of neutral molecules onto negative ions,
J. Chem. Phys., 1980, 73, 2195. [all data]
Bohringer, Fahey, et al., 1984
Bohringer, H.; Fahey, D.W.; Fehsenfeld, F.C.; Ferguson, E.E.,
Bond energies of the molecules H2O, SO2, H2O2, and HCl to various atmospheric negative ions,
J. Chem. Phys., 1984, 81, 2805. [all data]
Keesee and Castleman, 1986
Keesee, R.G.; Castleman, A.W., Jr.,
Thermochemical data on Ggs-phase ion-molecule association and clustering reactions,
J. Phys. Chem. Ref. Data, 1986, 15, 1011. [all data]
Devore and O'Neal, 1969
Devore, J.A.; O'Neal, H.E.,
Heats of formation of the acetyl halides and of the acetyl radical,
J. Phys. Chem., 1969, 73, 2644-2648. [all data]
Pritchard and Skinner, 1950
Pritchard, H.O.; Skinner, H.A.,
The heats of hydrolysis of the chloro-substituted acetyl chlorides,
J. Chem. Soc., 1950, 272-276. [all data]
Carson and Skinner, 1949
Carson, A.S.; Skinner, H.A.,
201. Carbon-halogen bond energies in the acetyl halides,
J. Chem. Soc., 1949, 936-939. [all data]
Buravtsev, Grigor'ev, et al., 1992
Buravtsev, N.N.; Grigor'ev, A.S.; Zaidman, O.A.; Kolbanovskii, Yu.A.; Markelov, M.YU.; Sadogurskii, M.N.; Treger, Yu.A.,
Dehydrochlorination of chloroalkanes under rigid homogeneous conditions. II. Effect of small additions of oxygen to the kinetics of high-temperature decomposition of 1,2-dichloroethane under adiabatic compression,
Khim. Fiz., 1992, 11, 218-226. [all data]
Levanova, Bushneva, et al., 1979
Levanova, s.V.; Bushneva, I.I.; Rodova, R.M.; Rozhnov, A.M.; Treger, Yu.A.; Aprelkin, A.S.,
Thermodynamic stability of chloroethanes in dehydrochlorination reactions,
J. Appl. Chem. USSR, 1979, 52, 1439-1442. [all data]
Ghosh and Guha, 1951
Ghosh, J.C.; Guha, S.R.D.,
Catalytic dehydrochlorination of ethylene dichloride,
Petroleum (London), 1951, 14, 261-264. [all data]
Howlett, 1955
Howlett, K.E.,
The use of equilibrium constants to calculate thermodynamic quantities. Part II,
J. Chem. Soc., 1955, 1784-17. [all data]
Lane, Linnett, et al., 1953
Lane, M.R.; Linnett, J.W.; Oswin, H.G.,
A study of the C2H4+HCl=C2H5Cl and C2H4+Hbr=C2H5Br equilibria,
Proc. Roy. Soc. London A, 1953, 216, 361-374. [all data]
Levanova, Treger, et al., 1975
Levanova, S.V.; Treger, Yu.A.; Velichko, S.M.; Rozhnov, A.M.; Bshneva, L.I.; Talanov, A.I.,
Equilibrium of the vinylidene chloride-methylchloroform system,
Zh. Prikl. Khim. (Leningrad), 1975, 42, 480-481. [all data]
Moselhy and Pritchard, 1975
Moselhy, G.M.; Pritchard, H.O.,
The thermochemistry of the chloro-benzoyl chlorides,
J. Chem. Thermodyn., 1975, 7, 977-982. [all data]
Carson, Pritchard, et al., 1950
Carson, A.S.; Pritchard, H.O.; Skinner, H.A.,
The heats of hydrolysis of the benzoyl halides,
J. Chem. Soc., 1950, 656-659. [all data]
Davies, Dunning, et al., 1972
Davies, J.V.; Dunning, B.K.; Pritchard, H.O.,
The enthalpy of formation of benzoyl chloride,
J. Chem. Thermodyn., 1972, 4, 731-737. [all data]
Noren and Sunner, 1970
Noren, I.; Sunner, S.,
The enthalpy of formation of 2-chloropropane from equilibrium studies,
J. Chem. Thermodyn., 1970, 2, 597-602. [all data]
Kabo and Andreevskii, 1963
Kabo, G.Ya.; Andreevskii, D.N.,
Equilibrium of 2-chloropropane dehydrochlorination,
Neftekhimiya, 1963, 3, 764-770. [all data]
Howlett, 1951
Howlett, K.E.,
The use of equilibrium constants to calculate thermodynamic quantities. Part I. Equilibria in the system tert.-butyl chloride, isobutene, hydrogen chloride,
J. Chem. Soc., 1951, 1409-1412. [all data]
Kistiakowsky and Stauffer, 1937
Kistiakowsky, G.B.; Stauffer, C.H.,
The kinetics of gaseous addition of halogen acids to isobutene, 1937, 165-170. [all data]
Arnett and Pienta, 1980
Arnett, E.M.; Pienta, N.J.,
Stabilities of carbonium ions in solution. 12. Heats of formation of alkyl chlorides as an entree to heats of solvation of aliphatic carbonium ions,
J. Am. Chem. Soc., 1980, 102, 3329-3334. [all data]
Nesterova, Kovzel, et al., 1977
Nesterova, T.N.; Kovzel, E.N.; Karaseva, S.Ya.; Rozhnov, A.M.,
Heats of reaction of the hydrohalogenation of styrene and α-methylstyrene,
Vses. Konf. Kalorim. Rasshir. Tezisy Dokl. 7th, 1977, 1, 132. [all data]
McMahon, Heinis, et al., 1988
McMahon, T.; Heinis, T.; Nicol, G.; Hovey, J.K.; Kebarle, P.,
Methyl Cation Affinities,
J. Am. Chem. Soc., 1988, 110, 23, 7591, https://doi.org/10.1021/ja00231a002
. [all data]
Foster, Williamson, et al., 1974
Foster, M.S.; Williamson, A.D.; Beauchamp, J.L.,
Photoionization mass spectrometry of trans-azomethane,
Int. J. Mass Spectrom. Ion Phys., 1974, 15, 429. [all data]
Levanova, Rodova, et al., 1983
Levanova, S.V.; Rodova, R.M.; Tereshkina, T.P.; Zabrodina, T.I.,
Thermocatalytic reactions of bromochloropropanes,
Russ. J. Phys. Chem. (Engl. Transl.), 1983, 57, 1142-1146. [all data]
Shevtsova, Rozhnov, et al., 1970
Shevtsova, L.A.; Rozhnov, A.M.; Andreevskii, D.N.,
Equilibrium Dehydrochlorination of 2,2-dichloropropane,
Russ. J. Phys. Chem. (Engl. Transl.), 1970, 44, 852-855. [all data]
Lacher, Amador, et al., 1967
Lacher, J.R.; Amador, A.; Park, J.D.,
Reaction heats of organic compounds. Part 5.-Heats of hydrogenation of dichloromethane, 1,1- and 1,2-dichloroethane and 1,2-dichloropropane,
Trans. Faraday Soc., 1967, 63, 1608-1611. [all data]
Cox and Pilcher, 1970
Cox, J.D.; Pilcher, G.,
Thermochemistry of Organic and Organometallic Compounds, Academic Press, New York, 1970, 1-636. [all data]
Levanova, Rozhnov, et al., 1972
Levanova, S.V.; Rozhnov, A.M.; Bortnik, O.K.,
Isomerization of dibromoethylenes,
Izv. Vyssh. Uchebn. Zaved., Khim. Khim. Tekhnol., 1972, 15, 1821-1823. [all data]
Lacher, Kianpour, et al., 1956
Lacher, J.R.; Kianpour, A.; Oetting, F.; Park, J.D.,
Reaction calorimetry. The hydrogenation of organic fluorides and chlorides,
Trans. Faraday Soc., 1956, 52, 1500-1508. [all data]
Levanova, Rodova, et al., 1974
Levanova, S.V.; Rodova, R.M.; Rozhnov, A.M.; Shevtsova, L.A.,
Thermodynamic calculation of the equilibrium composition of chlorobutene mixtures,
Russ. J. Phys. Chem. (Engl. Transl.), 1974, 48, 1113-1114. [all data]
Rodova, Levanova, et al., 1973
Rodova, R.M.; Levanova, S.V.; Shevtsova, L.A.; Rozhnov, A.M.; Porfir'eva, E.I.,
Reversible reactions of 2,3-dichlorobutane,
Russ. J. Phys. Chem. (Engl. Transl.), 1973, 47, 607. [all data]
Failes and Stimson, 1967
Failes, R.L.; Stimson, V.R.,
The thermal decomposition of 1-ethoxyethyl chloride and the reverse combination,
Aust. J. Chem., 1967, 20, 1553-1560. [all data]
Levanova, Bushneva, et al., 1976
Levanova, S.V.; Bushneva, L.I.; Rodova, R.M.; Rozhnov, A.M.; Treger, Yu.A.,
Liquid-phase dehydrochlorination of asymmetric tetrachloroethane,
Zh. Fiz. Khim., 1976, 50, 2701-2702. [all data]
Shaulov and Shmyreva, 1968
Shaulov, Yu.Kh.; Shmyreva, G.O.,
Russ. J. Phys. Chem., 1968, 42, 1008. [all data]
Meged, Levanova, et al., 1980
Meged, V.M.; Levanova, S.V.; Rozhnov, A.M.,
Dehydrohalogenation of dihalomethylbutanes. 2.,
Izv. Vyssh. Uchebn. Zaved., Khim. Khim. Tekhnol., 1980, 23, 149-151. [all data]
Larson and McMahon, 1985
Larson, J.W.; McMahon, T.B.,
Fluoride and chloride affinities of the main group oxides, fluorides, oxofluorides, and alkyls. Quantitative scales of lewis acidities from ICR halide exchange equilibria,
J. Am. Chem. Soc., 1985, 107, 766. [all data]
Rodova, Shevtsova, et al., 1974
Rodova, R.M.; Shevtsova, L.A.; Levanova, S.V.; Rozhnov, A.M.; Garkushin, I.K.,
Dehydrochlorination of 1,1-dichlorobutane and isomerization of chlorobutenes,
Izv. Vyssh. Uchebn. Zaved., Khim. Khim. Tekhnol., 1974, 17, 379-381. [all data]
Perry, Rowe, et al., 1980
Perry, R.A.; Rowe, B.R.; Viggiano, A.A.; Albritton, D.L.; Ferguson, E.E.; Fehsenfeld, F.C.,
Laboratory Measurements of Stratospheric Sodium Ion Measurements,
Geophys. Res. Lett., 1980, 7, 9, 693, https://doi.org/10.1029/GL007i009p00693
. [all data]
Dias, Salema, et al., 1982
Dias, A.R.; Salema, M.S.; Martinho Simões, J.A.,
Organometallics, 1982, 1, 971. [all data]
Calhorda, Dias, et al., 1987
Calhorda, M.J.; Dias, A.R.; Minas da Piedade M.E.; Salema, M.S.; Martinho Simões J.A.,
Organometallics, 1987, 6, 734. [all data]