(E)-Ethylene, 1,2-bis(methylthio)-
- Formula: C4H8S2
- Molecular weight: 120.236
- IUPAC Standard InChIKey: MRWRXEYAMMSGNE-ONEGZZNKSA-N
- CAS Registry Number: 764-45-4
- Chemical structure:
View 3d structure (requires JavaScript / HTML 5) - Stereoisomers:

Reaction thermochemistry data

Data compiled by: Hussein Y. Afeefy, Joel F. Liebman, and Stephen E. Stein
Individual Reactions
By formula: C4H8S2 = C4H8S2
Quantity | Value | Units | Method | Reference | Comment |
---|---|---|---|---|---|
ΔrH° | 3.89 ± 0.95 | kJ/mol | Eqk | Schroth, Schaedler, et al., 1985 | liquid phase |

Gas phase ion energetics data

Data compiled as indicated in comments:
LLK - Sharon G. Lias, Rhoda D. Levin, and Sherif A. Kafafi
Ionization energy determinations
IE (eV) | Method | Reference | Comment |
---|---|---|---|
7.85 | PE | Bock, Wagner, et al., 1974 | Vertical value; LLK |
7.96 | PE | Bock, Wagner, et al., 1972 | Vertical value; LLK |

References

Schroth, Schaedler, et al., 1985
Schroth, W.; Schaedler, H.D.; Kemmler, R.,
(Z, E) Isomerism of 1,2-bis(organothio)ethenes,
Z. Chem., 1985, 25, 170-171. [all data]
Bock, Wagner, et al., 1974
Bock, H.; Wagner, G.; Wittel, K.; Sauer, J.; Seebach, D.,
Photoelektronenspektren und molekuleigenschaften. XXXII. n/π-konjugation in heterosubstituierten athylenen,
Chem. Ber., 1974, 107, 1869. [all data]
Bock, Wagner, et al., 1972
Bock, H.; Wagner, G.; Kroner, J.,
Photoelektronenspektren und molekuleigenschaften, XIV. Die delokalisation des schwefel-elektronenpaar in CH3S-substituierten aromaten,
Chem. Ber., 1972, 105, 3850. [all data]