Fumaronitrile
- Formula: C4H2N2
- Molecular weight: 78.0721
- IUPAC Standard InChIKey: KYPOHTVBFVELTG-OWOJBTEDSA-N
- CAS Registry Number: 764-42-1
- Chemical structure:
View 3d structure (requires JavaScript / HTML 5) - Other names: 2-Butenedinitrile, (E)-; trans-1,2-Dicyanoethylene; Fumaric nitrile; Fumarodinitrile; Furmaronitrile; (E)-Butenedinitrile; (E)-CH(CN)CH(CN); But-2-enedinitrile, (E)-; (2E)-2-Butenedinitrile; (E)-1,2-Dicyanoethylene; 2-Butenedinitrile, (2E)-; NSC 17555; trans-1,2-Dicyanoethene

Gas phase thermochemistry data

Data compiled by: Hussein Y. Afeefy, Joel F. Liebman, and Stephen E. Stein
Quantity | Value | Units | Method | Reference | Comment |
---|---|---|---|---|---|
ΔfH°gas | 340. ± 3. | kJ/mol | Ccb | Boyd, Guha, et al., 1967 |

Condensed phase thermochemistry data

Data compiled by: Hussein Y. Afeefy, Joel F. Liebman, and Stephen E. Stein
Quantity | Value | Units | Method | Reference | Comment |
---|---|---|---|---|---|
ΔfH°solid | 268. ± 2. | kJ/mol | Ccb | Boyd, Guha, et al., 1967 | |
Quantity | Value | Units | Method | Reference | Comment |
ΔcH°solid | -2128. ± 2. | kJ/mol | Ccb | Boyd, Guha, et al., 1967 |

Phase change data

Data compiled as indicated in comments:
BS - Robert L. Brown and Stephen E. Stein
TRC - Thermodynamics Research Center, NIST Boulder Laboratories, Chris Muzny director
AC - William E. Acree, Jr., James S. Chickos
ALS - Hussein Y. Afeefy, Joel F. Liebman, and Stephen E. Stein
DRB - Donald R. Burgess, Jr.
Quantity | Value | Units | Method | Reference | Comment |
---|---|---|---|---|---|
Tboil | 459.2 | K | N/A | Weast and Grasselli, 1989 | BS |
Quantity | Value | Units | Method | Reference | Comment |
Tfus | 369. | K | N/A | Bader, Buckley, et al., 1957 | Uncertainty assigned by TRC = 3. K; TRC |
Tfus | 369.2 | K | N/A | de Wolf and Van de Straete, 1935 | Uncertainty assigned by TRC = 0.8 K; TRC |
Quantity | Value | Units | Method | Reference | Comment |
ΔsubH° | 68.6 | kJ/mol | N/A | De Wit, Van Miltenburg, et al., 1983 | AC |
ΔsubH° | 72.0 ± 0.8 | kJ/mol | V | Boyd, Guha, et al., 1967 | ALS |
ΔsubH° | 72.0 | kJ/mol | N/A | Boyd, Guha, et al., 1967 | DRB |
Enthalpy of sublimation
ΔsubH (kJ/mol) | Temperature (K) | Method | Reference | Comment |
---|---|---|---|---|
69.6 | 260. | TE,ME | De Wit, Van Miltenburg, et al., 1983 | Based on data from 250. to 269. K.; AC |
72. ± 0.8 | 263. | ME | Boyd, Guha, et al., 1967 | Based on data from 245. to 281. K. See also Cox and Pilcher, 1970.; AC |

Reaction thermochemistry data

Data compiled by: Hussein Y. Afeefy, Joel F. Liebman, and Stephen E. Stein
Individual Reactions
+
= C24H16N2O
By formula: C20H14O + C4H2N2 = C24H16N2O
Quantity | Value | Units | Method | Reference | Comment |
---|---|---|---|---|---|
ΔrH° | -82. | kJ/mol | Kin | Samuilov, Nurullina, et al., 1983 | liquid phase; solvent: Dichloroethane; Unpublished results |

Gas phase ion energetics data

Data compiled as indicated in comments:
LBLHLM - Sharon G. Lias, John E. Bartmess, Joel F. Liebman, John L. Holmes, Rhoda D. Levin, and W. Gary Mallard
LLK - Sharon G. Lias, Rhoda D. Levin, and Sherif A. Kafafi
B - John E. Bartmess
Electron affinity determinations
EA (eV) | Method | Reference | Comment |
---|---|---|---|
1.249 ± 0.087 | TDEq | Chowdhury and Kebarle, 1986 | ΔGea(523 K) = -28.4 kcal/mol; ΔSea = -1.0 eu.; B |
0.79 ± 0.10 | SI | Farragher and Page, 1967 | The Magnetron method, lacking mass analysis, is not considered reliable.; B |
Ionization energy determinations
IE (eV) | Method | Reference | Comment |
---|---|---|---|
11.16 ± 0.03 | PI | Kotov and Potapov, 1972 | LLK |
11.15 | PE | Bock and Stafast, 1972 | LLK |
11.3 | PE | Bieri, Asbrink, et al., 1982 | Vertical value; LBLHLM |

References

Boyd, Guha, et al., 1967
Boyd, R.H.; Guha, K.R.; Wuthrich, R.,
Thermochemistry of cyanocarbons. II. The heats of combustion of pyridinium dicyanomethylide, malononitrile, and fumaronitrile,
J. Phys. Chem., 1967, 71, 2187-2191. [all data]
Weast and Grasselli, 1989
CRC Handbook of Data on Organic Compounds, 2nd Editon, Weast,R.C and Grasselli, J.G., ed(s)., CRC Press, Inc., Boca Raton, FL, 1989, 1. [all data]
Bader, Buckley, et al., 1957
Bader, A.R.; Buckley, R.P.; Leavitt, F.; Szwarc, M.,
J. Am. Chem. Soc., 1957, 79, 5621. [all data]
de Wolf and Van de Straete, 1935
de Wolf, J.; Van de Straete, L.,
Maleonitrile and Fumaronitrole,
Bull. Cl. Sci., Acad. R. Belg., 1935, 21, 216. [all data]
De Wit, Van Miltenburg, et al., 1983
De Wit, H.G.M.; Van Miltenburg, J.C.; De Kruif, C.G.,
Thermodynamic properties of molecular organic crystals containing nitrogen, oxygen, and sulphur 1. Vapour pressures and enthalpies of sublimation,
The Journal of Chemical Thermodynamics, 1983, 15, 7, 651-663, https://doi.org/10.1016/0021-9614(83)90079-4
. [all data]
Cox and Pilcher, 1970
Cox, J.D.; Pilcher, G.,
Thermochemistry of Organic and Organometallic Compounds, Academic Press Inc., London, 1970, 643. [all data]
Samuilov, Nurullina, et al., 1983
Samuilov, Ya.D.; Nurullina, R.L.; Konovalov, A.I.,
Thermochemical and kinetic study of the Diels-Alder reaction with ethylene and acetylene dienophiles,
Zh. Org. Khim., 1983, 19, 1431-1435. [all data]
Chowdhury and Kebarle, 1986
Chowdhury, S.; Kebarle, P.,
Electron affinities of di- and tetracyanoethylene and cyanobenzenes based on measurements of gas-phase electron transfer equilibria,
J. Am. Chem. Soc., 1986, 108, 5453. [all data]
Farragher and Page, 1967
Farragher, A.L.; Page, F.M.,
Experimental Determination of Electron Affinities. Part 11. - Electron Capture by Some Cyanocarbons and Related Compounds,
Trans. Farad. Soc., 1967, 63, 2369, https://doi.org/10.1039/tf9676302369
. [all data]
Kotov and Potapov, 1972
Kotov, B.V.; Potapov, V.K.,
Ionization potentials of strong organic electron acceptors,
Khim. Vys. Energ., 1972, 6, 375. [all data]
Bock and Stafast, 1972
Bock, H.; Stafast, H.,
Photoelektronenspektren und molekuleigenschaften, IX. Die π-Systeme der cis- und trans-dicyan-athylene,
Chem. Ber., 1972, 105, 1158. [all data]
Bieri, Asbrink, et al., 1982
Bieri, G.; Asbrink, L.; Von Niessen, W.,
30.4-nm He(II) photoelectron spectra of organic molecules,
J. Electron Spectrosc. Relat. Phenom., 1982, 27, 129. [all data]