2-Pentenal
- Formula: C5H8O
- Molecular weight: 84.1164
- IUPAC Standard InChIKey: DTCCTIQRPGSLPT-UHFFFAOYSA-N
- CAS Registry Number: 764-39-6
- Chemical structure:
View 3d structure (requires JavaScript / HTML 5) - Species with the same structure:
- Stereoisomers:
- Other names: Pent-2-enal

Phase change data

Data compiled by: Thermodynamics Research Center, NIST Boulder Laboratories, Chris Muzny director
Quantity | Value | Units | Method | Reference | Comment |
---|---|---|---|---|---|
Tboil | 397. | K | N/A | Gorge, 1951 | Uncertainty assigned by TRC = 3. K |

Gas phase ion energetics data

Data compiled as indicated in comments:
LLK - Sharon G. Lias, Rhoda D. Levin, and Sherif A. Kafafi
Ionization energy determinations
IE (eV) | Method | Reference | Comment |
---|---|---|---|
9.70 | PE | Masclet and Mouvier, 1978 | LLK |

Van Den Dool and Kratz RI, polar column, temperature ramp

Data compiled by: NIST Mass Spectrometry Data Center, William E. Wallace, director

Column type CapillaryCapillary
Active phase ZB-WaxZB-Wax
Column length (m) 30.30.
Carrier gas HeHe
Substrate
Column diameter (mm) 0.250.25
Phase thickness (μm) 0.150.15
Tstart (C) 35.35.
Tend (C) 220.220.
Heat rate (K/min) 5.5.
Initial hold (min) 5.5.
Final hold (min) 10.10.
I 1073.1073.
ReferenceLedauphin, Basset, et al., 2006Ledauphin, Saint-Clair, et al., 2004
Comment MSDC-RI MSDC-RI

Normal alkane RI, non-polar column, temperature ramp

Data compiled by: NIST Mass Spectrometry Data Center, William E. Wallace, director

Column type CapillaryCapillary
Active phase HP-1OV-101
Column length (m) 50.50.
Carrier gas N2He
Substrate
Column diameter (mm) 0.20.32
Phase thickness (μm) 0.330.5
Tstart (C) 60.50.
Tend (C) 250.250.
Heat rate (K/min) 2.4.
Initial hold (min)
Final hold (min) 20.
I 718.719.
ReferenceCavalli, Fernandez, et al., 2004Misharina, Golovnya, et al., 1991
Comment MSDC-RI MSDC-RI

References

Gorge, 1951
Gorge, M.,
New Contributions to the Studyof γ-Ethylene Glycols,
Ann. Chim.(Paris), 1951, 6, 649-704. [all data]
Masclet and Mouvier, 1978
Masclet, P.; Mouvier, G.,
Etude par spectrometrie photoelectronique d'aldehydes et de cetones ethyleniques conjugues,
J. Electron Spectrosc. Relat. Phenom., 1978, 14, 77. [all data]