2-Hexyne
- Formula: C6H10
- Molecular weight: 82.1436
- IUPAC Standard InChIKey: MELUCTCJOARQQG-UHFFFAOYSA-N
- CAS Registry Number: 764-35-2
- Chemical structure:
View 3d structure (requires JavaScript / HTML 5) - Other names: Methyl(propyl)acetylene; 1-Methyl-2-propylacetylene; C3H7C≡CCH3; Hex-2-yne

Gas phase thermochemistry data

Data compiled as indicated in comments:
ALS - Hussein Y. Afeefy, Joel F. Liebman, and Stephen E. Stein
GT - Glushko Thermocenter, Russian Academy of Sciences, Moscow
Quantity | Value | Units | Method | Reference | Comment |
---|---|---|---|---|---|
ΔfH°gas | 107.7 ± 2.4 | kJ/mol | Chyd | Rogers, Dagdagan, et al., 1979 | ALS |
Constant pressure heat capacity of gas
Cp,gas (J/mol*K) | Temperature (K) | Reference | Comment |
---|---|---|---|
49.86 | 50. | Thermodynamics Research Center, 1997 | p=1 bar.; GT |
64.91 | 100. | ||
78.89 | 150. | ||
91.71 | 200. | ||
112.12 | 273.15 | ||
119.65 | 298.15 | ||
120.22 | 300. | ||
150.81 | 400. | ||
178.87 | 500. | ||
203.08 | 600. | ||
223.80 | 700. | ||
241.63 | 800. | ||
257.03 | 900. | ||
270.34 | 1000. | ||
281.9 | 1100. | ||
291.8 | 1200. | ||
300.5 | 1300. | ||
308.0 | 1400. | ||
314.4 | 1500. |

Phase change data

Data compiled as indicated in comments:
BS - Robert L. Brown and Stephen E. Stein
TRC - Thermodynamics Research Center, NIST Boulder Laboratories, Chris Muzny director
AC - William E. Acree, Jr., James S. Chickos
Quantity | Value | Units | Method | Reference | Comment |
---|---|---|---|---|---|
Tboil | 357.1 ± 0.8 | K | AVG | N/A | Average of 17 out of 20 values; Individual data points |
Quantity | Value | Units | Method | Reference | Comment |
Tfus | 183.57 | K | N/A | Pomerantz, Fookson, et al., 1954 | Uncertainty assigned by TRC = 0.3 K; TRC |
Tfus | 185.15 | K | N/A | Campbell and Eby, 1941 | Uncertainty assigned by TRC = 1.5 K; TRC |
Quantity | Value | Units | Method | Reference | Comment |
ΔvapH° | 35.8 | kJ/mol | N/A | Boukais-Belaribi, Belaribi, et al., 2007 | Based on data from 283. to 313. K.; AC |
ΔvapH° | 35.9 | kJ/mol | N/A | Boukais-Belaribi, Belaribi, et al., 2006 | Based on data from 283. to 313. K.; AC |
Enthalpy of vaporization
ΔvapH (kJ/mol) | Temperature (K) | Method | Reference | Comment |
---|---|---|---|---|
30.5 | 268. | A | Stephenson and Malanowski, 1987 | Based on data from 253. to 354. K.; AC |
31.6 | 275. | T | Rondeau and Harrah, 1965 | Based on data from 253. to 298. K.; AC |

Reaction thermochemistry data

Data compiled by: Hussein Y. Afeefy, Joel F. Liebman, and Stephen E. Stein
Individual Reactions
By formula: 2H2 + C6H10 = C6H14
Quantity | Value | Units | Method | Reference | Comment |
---|---|---|---|---|---|
ΔrH° | -275. ± 2. | kJ/mol | Chyd | Rogers, Dagdagan, et al., 1979 | liquid phase; solvent: Hexane |

Gas phase ion energetics data

Data evaluated as indicated in comments:
HL - Edward P. Hunter and Sharon G. Lias
L - Sharon G. Lias
Data compiled as indicated in comments:
LLK - Sharon G. Lias, Rhoda D. Levin, and Sherif A. Kafafi
RDSH - Henry M. Rosenstock, Keith Draxl, Bruce W. Steiner, and John T. Herron
Quantity | Value | Units | Method | Reference | Comment |
---|---|---|---|---|---|
IE (evaluated) | 9.37 ± 0.01 | eV | N/A | N/A | L |
Quantity | Value | Units | Method | Reference | Comment |
Proton affinity (review) | 806.1 | kJ/mol | N/A | Hunter and Lias, 1998 | HL |
Quantity | Value | Units | Method | Reference | Comment |
Gas basicity | 781.1 | kJ/mol | N/A | Hunter and Lias, 1998 | HL |
Ionization energy determinations
IE (eV) | Method | Reference | Comment |
---|---|---|---|
9.37 ± 0.05 | EI | Wolkoff, Holmes, et al., 1980 | LLK |
9.37 ± 0.02 | PE | Bieri, Burger, et al., 1977 | LLK |
9.366 ± 0.005 | PE | Carlier, Dubois, et al., 1975 | LLK |
9.97 ± 0.05 | EI | Praet, 1970 | RDSH |
Appearance energy determinations
Ion | AE (eV) | Other Products | Method | Reference | Comment |
---|---|---|---|---|---|
C3H5+ | 13.9 ± 0.01 | ? | EI | Praet, 1970 | RDSH |
C4H6+ | 11.02 ± 0.05 | C2H4 | EI | Praet, 1970 | RDSH |
C5H7+ | ≤9.93 ± 0.05 | CH3 | EI | Wolkoff, Holmes, et al., 1980 | LLK |
C5H7+ | 10.63 ± 0.05 | CH3 | EI | Praet, 1970 | RDSH |
C6H9+ | 10.81 ± 0.05 | H | EI | Praet, 1970 | RDSH |

Kovats' RI, non-polar column, isothermal

Column type | Active phase | Temperature (C) | I | Reference | Comment |
---|---|---|---|---|---|
Packed | C78, Branched paraffin | 130. | 642.0 | Dallos, Sisak, et al., 2000 | He; Column length: 3.3 m |
Packed | C78, Branched paraffin | 130. | 642.2 | Reddy, Dutoit, et al., 1992 | Chromosorb G HP; Column length: 3.3 m |
Capillary | Squalane | 80. | 640. | Soják, Farkas, et al., 1991 | 107. m/0.25 mm/0.40 μm, H2 |
Capillary | Squalane | 100. | 639. | Rang, Kuningas, et al., 1976 | N2; Column length: 100. m; Column diameter: 0.25 mm |
Capillary | Squalane | 110. | 638. | Rang, Kuningas, et al., 1976 | N2; Column length: 100. m; Column diameter: 0.25 mm |
Capillary | Squalane | 120. | 638. | Rang, Kuningas, et al., 1976 | N2; Column length: 100. m; Column diameter: 0.25 mm |
Capillary | Squalane | 130. | 638. | Rang, Kuningas, et al., 1976 | N2; Column length: 100. m; Column diameter: 0.25 mm |
Capillary | Squalane | 86. | 642. | Rang, Kuningas, et al., 1976 | N2; Column length: 100. m; Column diameter: 0.25 mm |
Capillary | Squalane | 90. | 640. | Rang, Kuningas, et al., 1976 | N2; Column length: 100. m; Column diameter: 0.25 mm |
Capillary | Squalane | 60. | 644. | Orav and Eisen, 1972 | Column length: 80. m; Column diameter: 0.25 mm |
Packed | Squalane | 27. | 645. | Hively and Hinton, 1968 | He, Chromosorb P; Column length: 15. m; Column diameter: 0.25 mm |
Packed | Squalane | 49. | 644. | Hively and Hinton, 1968 | He, Chromosorb P; Column length: 15. m; Column diameter: 0.25 mm |
Packed | Squalane | 67. | 644. | Hively and Hinton, 1968 | He, Chromosorb P; Column length: 15. m; Column diameter: 0.25 mm |
Packed | Squalane | 86. | 642. | Hively and Hinton, 1968 | He, Chromosorb P; Column length: 15. m; Column diameter: 0.25 mm |

Kovats' RI, polar column, isothermal

Column type | Active phase | Temperature (C) | I | Reference | Comment |
---|---|---|---|---|---|
Capillary | PEG 4000 | 110. | 860. | Rang, Orav, et al., 1988 | |
Capillary | PEG 4000 | 60. | 864. | Rang, Orav, et al., 1988 | |
Capillary | PEG 4000 | 80. | 862. | Rang, Orav, et al., 1988 | |
Capillary | PEG 4000 | 60. | 876.6 | Orav and Eisen, 1972 | Column length: 80. m; Column diameter: 0.25 mm |

Normal alkane RI, non-polar column, custom temperature program

Column type | Active phase | I | Reference | Comment |
---|---|---|---|---|
Capillary | Methyl Silicone | 655. | Zenkevich and Marinichev, 2001 | Program: not specified |

References

Rogers, Dagdagan, et al., 1979
Rogers, D.W.; Dagdagan, O.A.; Allinger, N.L.,
Heats of hydrogenation and formation of linear alkynes and a molecular mechanics interpretation,
J. Am. Chem. Soc., 1979, 101, 671-676. [all data]
Thermodynamics Research Center, 1997
Thermodynamics Research Center,
Selected Values of Properties of Chemical Compounds., Thermodynamics Research Center, Texas A&M University, College Station, Texas, 1997. [all data]
Pomerantz, Fookson, et al., 1954
Pomerantz, P.; Fookson, A.; Mears, T.W.; Rothberg, S.; Howard, F.L.,
Synthesis and Physical Properties of Several Acetylenic Hydrocarbons,
J. Res. Natl. Bur. Stand. (U. S.), 1954, 52, 51. [all data]
Campbell and Eby, 1941
Campbell, K.N.; Eby, L.T.,
The Reduction of Multiple Carbon-Carbon Bonds III. Further Studies on the Preparation of Olefins from Acetylenes,
J. Am. Chem. Soc., 1941, 63, 2683. [all data]
Boukais-Belaribi, Belaribi, et al., 2007
Boukais-Belaribi, Ghénima; Belaribi, Brahim Farid; Lohmann, Juergën; Jose, Jacques,
Isothermal vapour--liquid equilibria and excess molar enthalpies of hex-2-yne+methyl butyl ether and hex-3-yne+dibutyl ether mixtures,
Fluid Phase Equilibria, 2007, 262, 1-2, 180-186, https://doi.org/10.1016/j.fluid.2007.09.002
. [all data]
Boukais-Belaribi, Belaribi, et al., 2006
Boukais-Belaribi, Ghénima; Belaribi, Brahim Farid; Ait-Kaci, Ahmed; Jose, Jacques,
Thermodynamics of isomeric hexynes+MTBE binary mixtures,
Fluid Phase Equilibria, 2006, 248, 2, 181-190, https://doi.org/10.1016/j.fluid.2006.08.007
. [all data]
Stephenson and Malanowski, 1987
Stephenson, Richard M.; Malanowski, Stanislaw,
Handbook of the Thermodynamics of Organic Compounds, 1987, https://doi.org/10.1007/978-94-009-3173-2
. [all data]
Rondeau and Harrah, 1965
Rondeau, R.E.; Harrah, L.A.,
Melting Point and Vapor Pressures of 3-Hexyne.,
J. Chem. Eng. Data, 1965, 10, 1, 84-85, https://doi.org/10.1021/je60024a031
. [all data]
Hunter and Lias, 1998
Hunter, E.P.; Lias, S.G.,
Evaluated Gas Phase Basicities and Proton Affinities of Molecules: An Update,
J. Phys. Chem. Ref. Data, 1998, 27, 3, 413-656, https://doi.org/10.1063/1.556018
. [all data]
Wolkoff, Holmes, et al., 1980
Wolkoff, P.; Holmes, J.L.; Lossing, F.P.,
On the formation of cyclopentenium cations from all C6H10+ molecular ion structures,
Can. J. Chem., 1980, 58, 251. [all data]
Bieri, Burger, et al., 1977
Bieri, G.; Burger, F.; Heilbronner, E.; Maier, J.P.,
Valence ionization enrgies of hydrocarbons,
Helv. Chim. Acta, 1977, 60, 2213. [all data]
Carlier, Dubois, et al., 1975
Carlier, P.; Dubois, J.E.; Masclet, P.; Mouvier, G.,
Spectres de photoelectrons des alcynes,
J. Electron Spectrosc. Relat. Phenom., 1975, 7, 55. [all data]
Praet, 1970
Praet, M.-Th.,
Ionisation et dissociation du 1-methyl-cyclopentene, du methylenecyclopentane et de quelques isomeres par impact d'electrons et de photons,
Org. Mass Spectrom., 1970, 4, 65. [all data]
Dallos, Sisak, et al., 2000
Dallos, A.; Sisak, A.; Kulcsár, Z.; Kováts, E.,
Pair-wise interactions by gas chromatography VII. Interaction free enthalpies of solutes with secondary alcohol groups,
J. Chromatogr. A, 2000, 904, 2, 211-242, https://doi.org/10.1016/S0021-9673(00)00908-0
. [all data]
Reddy, Dutoit, et al., 1992
Reddy, K.S.; Dutoit, J.-Cl.; Kovats, E. sz.,
Pair-wise interactions by gas chromatography. I. Interaction free enthalpies of solutes with non-associated primary alcohol groups,
J. Chromatogr., 1992, 609, 1-2, 229-259, https://doi.org/10.1016/0021-9673(92)80167-S
. [all data]
Soják, Farkas, et al., 1991
Soják, L.; Farkas, P.; Ostrovský, I.; Janák, J.; Chrétien, J.R.,
Capillary gas chromatography of C5 - C13 branched alkynes on squalane and liquid crystal stationary phases,
J. Chromatogr., 1991, 557, 241-253, https://doi.org/10.1016/S0021-9673(01)87136-3
. [all data]
Rang, Kuningas, et al., 1976
Rang, S.; Kuningas, K.; Orav, A.; Eisen, O.,
Capillary gas chromatography of n-alkynes. I. Retention indices,
J. Chromatogr., 1976, 119, 451-460, https://doi.org/10.1016/S0021-9673(00)86807-7
. [all data]
Orav and Eisen, 1972
Orav, A.; Eisen, O.,
The retention indexes for alkenes, alkynes and cyclenes on capillary columns,
Izv. Akad. Nauk Est. SSR, Khim. Geol., 1972, 21, 1, 39-47. [all data]
Hively and Hinton, 1968
Hively, R.A.; Hinton, R.E.,
Variation of the retention index with temperature on squalane substrates,
J. Gas Chromatogr., 1968, 6, 4, 203-217, https://doi.org/10.1093/chromsci/6.4.203
. [all data]
Rang, Orav, et al., 1988
Rang, S.A.; Orav, A.E.; Kuningas, K.R.; Meister, A.E.; Strense, T.V.; Eisen, O.G.,
Gas-Chromatographic Characteristics of unsaturated hydrocarbons, Academy of Sciences of Estonia SSR, Tallinn, Estonia SSR, 1988, 208. [all data]
Zenkevich and Marinichev, 2001
Zenkevich, I.G.; Marinichev, A.N.,
Comparison of Topological and Dynamics Molecular Characteristics for Precalculation of Chromatographic Retention Parameters of Organic Compounds (in Russian),
Zh. Struct. Khim., 2001, 42, 5, 893-902. [all data]