Dewar benzene, hexamethyl-
- Formula: C12H18
- Molecular weight: 162.2713
- IUPAC Standard InChIKey: RVNQQZMIWZPGNA-UHFFFAOYSA-N
- CAS Registry Number: 7641-77-2
- Chemical structure:
View 3d structure (requires JavaScript / HTML 5) - Other names: Bicyclo[2.2.0]hexa-2,5-diene, 1,2,3,4,5,6-hexamethyl-; Hexamethyl Dewar benzene; Hexamethylbicyclo[2.2.0]hexa-2,5-diene; 1,2,3,4,5,6-Hexamethylbicyclo[2.2.0]hexa-2,5-diene; Bicyclo(2.2.0)hexa-2,5-diene, hexamethyl-; 2-Butin hexamethyl-dewar-benzol; Hexamethyl-bicyclo(2.2.0)hexa-2,5-dien; 1,2,3,4,5,6-hexamethylbicyclo(2,2,0)hexa-2,5-diene

Condensed phase thermochemistry data

Data compiled by: Hussein Y. Afeefy, Joel F. Liebman, and Stephen E. Stein
Quantity | Value | Units | Method | Reference | Comment |
---|---|---|---|---|---|
ΔfH°liquid | -90.4 | kJ/mol | Ccb | Schafer and Hellmann, 1967 | |
Quantity | Value | Units | Method | Reference | Comment |
ΔcH°liquid | -7385. ± 4.6 | kJ/mol | Ccb | Schafer and Hellmann, 1967 | Corresponding ΔfHºliquid = 92. kJ/mol (simple calculation by NIST; no Washburn corrections) |

Phase change data

Data compiled by: Robert L. Brown and Stephen E. Stein
Reduced pressure boiling point
Tboil (K) | Pressure (bar) | Reference |
---|---|---|
333.2 | 0.027 | Aldrich Chemical Company Inc., 1990 |

Reaction thermochemistry data

Data compiled by: Hussein Y. Afeefy, Joel F. Liebman, and Stephen E. Stein
Individual Reactions
By formula: C12H18 = C12H18
Quantity | Value | Units | Method | Reference | Comment |
---|---|---|---|---|---|
ΔrH° | -235. ± 3. | kJ/mol | Cm | Adam and Chang, 1969 | liquid phase; solvent: Pure phase |
ΔrH° | -249. | kJ/mol | Eqk | Oth, 1968 | liquid phase; Heat of isomerization, see Oth, 1969 |
By formula: C12H18 = C12H18
Quantity | Value | Units | Method | Reference | Comment |
---|---|---|---|---|---|
ΔrH° | -233. ± 3. | kJ/mol | Cm | Adam and Chang, 1969 | liquid phase; solvent: Pure phase; Heat of isomerization |

Gas phase ion energetics data

Data compiled as indicated in comments:
LLK - Sharon G. Lias, Rhoda D. Levin, and Sherif A. Kafafi
Ionization energy determinations
IE (eV) | Method | Reference | Comment |
---|---|---|---|
7.83 | PE | Bougeard, Schrader, et al., 1974 | Vertical value; LLK |
7.92 | PE | Marschner, Juds, et al., 1973 | Vertical value; LLK |

References

Schafer and Hellmann, 1967
Schafer, W.; Hellmann, H.,
Hexamethyl-Dewar-Benzol (Hexamethyl-bicyclo[2.2.0]hexa-2,5-dien),
Angew. Chem., 1967, 79, 566-573. [all data]
Aldrich Chemical Company Inc., 1990
Aldrich Chemical Company Inc.,
Catalog Handbook of Fine Chemicals, Aldrich Chemical Company, Inc., Milwaukee WI, 1990, 1. [all data]
Adam and Chang, 1969
Adam, W.; Chang, J.C.,
Kinetics and thermochemistry of valence isomerization by differential scanning calorimetry: the case of hexamethylprismane and hexamethyldewarbenzene,
Int. J. Chem. Kinet., 1969, 1, 487-492. [all data]
Oth, 1968
Oth, J.F.M.,
The kinetics and thermochemistry of the thermal rearrangement of hexamethylbicyclo[2.2.0]hexa-2,5-diene (hexamethyldewarbenzene) and of hexamethyltetracyclo[2.2.0,0(2,6).0(3,5)]hexane (hexamethylprismane),
Chem. Ber., 1968, 47, 1185-1195. [all data]
Oth, 1969
Oth, J.F.M.,
The kinetics and thermochemistry of the thermal rearrangement of hexamethyl(Dewar benzene) and of hexamethylprismane,
Angew. Chem. Int. Ed. Engl., 1969, 7, 646. [all data]
Bougeard, Schrader, et al., 1974
Bougeard, D.; Schrader, B.; Bleckmann, P.; Plesser, T.,
Ramanspektroskopie und molekulstruktur. VII. Infrarot-, raman- und photoelektronenspektrum des hexamethyl-dewarbenzols; normalkoordinatenberechnung und untersuchung der π-elektronen-wechselwirkung,
Justus Liebigs Ann. Chem., 1974, 156, 137. [all data]
Marschner, Juds, et al., 1973
Marschner, F.; Juds, H.; Goetz, H.,
Zur homokonjugation im hexamethyl-dewar-benzol,
Tetrahedron Lett., 1973, 3983. [all data]
(editor), 1973
(editor), Koptyug V.A.,
Atlas of Spectra of Aromatic and Heterocyclic Compounds, 1973, 3, 75. [all data]