2,4-Hexadiene, 2,5-dimethyl-
- Formula: C8H14
- Molecular weight: 110.1968
- IUPAC Standard InChIKey: DZPCYXCBXGQBRN-UHFFFAOYSA-N
- CAS Registry Number: 764-13-6
- Chemical structure:
View 3d structure (requires JavaScript / HTML 5) - Other names: Biisobutenyl; Biisocrotyl; Diisocrotyl; 2,5-Dimethyl-2,4-hexadiene; (CH3)2C=CHCH=C(CH3)2; 2,5-Dimethylhexa-2,4-diene; NSC 10812

Gas phase thermochemistry data

Data compiled by: Hussein Y. Afeefy, Joel F. Liebman, and Stephen E. Stein
Quantity | Value | Units | Method | Reference | Comment |
---|---|---|---|---|---|
ΔfH°gas | -19.20 ± 0.84 | kJ/mol | Ccr | Steele, Chirico, et al., 1990 |

Condensed phase thermochemistry data

Data compiled as indicated in comments:
ALS - Hussein Y. Afeefy, Joel F. Liebman, and Stephen E. Stein
DH - Eugene S. Domalski and Elizabeth D. Hearing
Quantity | Value | Units | Method | Reference | Comment |
---|---|---|---|---|---|
ΔfH°liquid | -63.12 ± 0.84 | kJ/mol | Ccr | Steele, Chirico, et al., 1990 | ALS |
Quantity | Value | Units | Method | Reference | Comment |
ΔcH°liquid | -5085.77 ± 0.70 | kJ/mol | Ccr | Steele, Chirico, et al., 1990 | Corresponding ΔfHºliquid = -63.12 kJ/mol (simple calculation by NIST; no Washburn corrections); ALS |
Constant pressure heat capacity of liquid
Cp,liquid (J/mol*K) | Temperature (K) | Reference | Comment |
---|---|---|---|
459.0 | 298.15 | Steele, Chirico, et al., 1990 | Authors give Cp/R = 55.2. This value appears too large by a factor of two. Actual Cp should be around 229.5 J/mol*K.; DH |

Phase change data

Data compiled as indicated in comments:
BS - Robert L. Brown and Stephen E. Stein
TRC - Thermodynamics Research Center, NIST Boulder Laboratories, Chris Muzny director
ALS - Hussein Y. Afeefy, Joel F. Liebman, and Stephen E. Stein
Quantity | Value | Units | Method | Reference | Comment |
---|---|---|---|---|---|
Tboil | 407. ± 2. | K | AVG | N/A | Average of 13 out of 14 values; Individual data points |
Quantity | Value | Units | Method | Reference | Comment |
Tfus | 287.1 ± 0.6 | K | AVG | N/A | Average of 8 values; Individual data points |
Quantity | Value | Units | Method | Reference | Comment |
ΔvapH° | 43.92 ± 0.05 | kJ/mol | V | Steele, Chirico, et al., 1990 | ALS |

Gas phase ion energetics data

Data compiled as indicated in comments:
LL - Sharon G. Lias and Joel F. Liebman
LLK - Sharon G. Lias, Rhoda D. Levin, and Sherif A. Kafafi
RDSH - Henry M. Rosenstock, Keith Draxl, Bruce W. Steiner, and John T. Herron
Ionization energy determinations
IE (eV) | Method | Reference | Comment |
---|---|---|---|
7.67 | PE | Masclet, Mouvier, et al., 1981 | LLK |
7.65 | PE | Beez, Bieri, et al., 1973 | LLK |
7.91 ± 0.04 | EI | Franklin and Mogenis, 1967 | RDSH |
7.67 | PE | Werstiuk, Clark, et al., 1990 | Vertical value; LL |
Appearance energy determinations
Ion | AE (eV) | Other Products | Method | Reference | Comment |
---|---|---|---|---|---|
C3H3+ | 26.5 ± 0.1 | ? | EI | Franklin and Mogenis, 1967 | RDSH |
C3H5+ | 14.27 ± 0.03 | ? | EI | Franklin and Mogenis, 1967 | RDSH |
C3H7+ | 12.23 ± 0.06 | ? | EI | Franklin and Mogenis, 1967 | RDSH |
C4H5+ | 14.60 ± 0.04 | ? | EI | Franklin and Mogenis, 1967 | RDSH |
C4H7+ | 13.03 ± 0.02 | ? | EI | Franklin and Mogenis, 1967 | RDSH |
C5H7+ | 12.88 ± 0.03 | C2H4+CH3 | EI | Franklin and Mogenis, 1967 | RDSH |
C6H5+ | 16.1 ± 0.1 | ? | EI | Franklin and Mogenis, 1967 | RDSH |
C6H7+ | 14.42 ± 0.05 | ? | EI | Franklin and Mogenis, 1967 | RDSH |
C6H9+ | 11.7 ± 0.1 | ? | EI | Franklin and Mogenis, 1967 | RDSH |
C7H11+ | 10.80 ± 0.03 | CH3 | EI | Franklin and Mogenis, 1967 | RDSH |

Kovats' RI, non-polar column, isothermal

Column type | Active phase | Temperature (C) | I | Reference | Comment |
---|---|---|---|---|---|
Capillary | SE-30 | 130. | 861. | Bredael, 1982 | Column length: 100. m; Column diameter: 0.5 mm |
Capillary | SE-30 | 80. | 862. | Bredael, 1982 | Column length: 100. m; Column diameter: 0.5 mm |

Van Den Dool and Kratz RI, polar column, temperature ramp

Column type | Active phase | I | Reference | Comment |
---|---|---|---|---|
Capillary | Supelcowax-10 | 1032. | Matiella and Hsieh, 1990 | 60. m/0.25 mm/0.25 μm, 40. C @ 5. min, 2. K/min, 175. C @ 20. min |

Normal alkane RI, non-polar column, temperature ramp

Column type | Active phase | I | Reference | Comment |
---|---|---|---|---|
Capillary | OV-1 | 821. | Orav, Kailas, et al., 1999 | 2. K/min; Tstart: 50. C; Tend: 160. C |
Capillary | OV-101 | 858. | Chupalov and Zenkevich, 1996 | N2, 3. K/min; Column length: 52. m; Column diameter: 0.26 mm; Tstart: 50. C; Tend: 220. C |
Capillary | OV-101 | 861. | Zenkevich and Kulikova, 1993 | He, 3. K/min; Column length: 54. m; Column diameter: 0.26 mm; Tstart: 50. C; Tend: 230. C |

Normal alkane RI, non-polar column, custom temperature program

Column type | Active phase | I | Reference | Comment |
---|---|---|---|---|
Capillary | OV-1, SE-30, Methyl silicone, SP-2100, OV-101, DB-1, etc. | 862. | Waggott and Davies, 1984 | Hydrogen; Column length: 50. m; Column diameter: 0.32 mm; Program: not specified |

References

Steele, Chirico, et al., 1990
Steele, W.V.; Chirico, R.D.; Nguyen, A.; Hossenlopp, I.A.; Smith, N.K.,
Determination of ideal-gas enthalpies of formation for key compounds,
Am. Inst. Chem. Eng. Symp. Ser. (AIChE Symp. Ser.), 1990, 138-154. [all data]
Masclet, Mouvier, et al., 1981
Masclet, P.; Mouvier, G.; Bocquet, J.F.,
Effets electroniques et effets steriques dus a la substitution alcoyle dans les dienes conjugues,
J. Chim. Phys., 1981, 78, 99. [all data]
Beez, Bieri, et al., 1973
Beez, M.; Bieri, G.; Bock, H.; Heilbronner, E.,
The ionization potentials of butadiene, hexatriene, andtheir methyl derivatives: evidence for through space interaction between double bond π-orbitals and non-bonded pseudo-π orbitals of methyl groups?,
Helv. Chim. Acta, 1973, 56, 1028. [all data]
Franklin and Mogenis, 1967
Franklin, J.L.; Mogenis, A.,
An electron impact study of ions from several dienes,
J. Phys. Chem., 1967, 71, 2820. [all data]
Werstiuk, Clark, et al., 1990
Werstiuk, N.H.; Clark, K.B.; Leigh, W.J.,
Conformational analysis and structure elucidation of 2,3-dimethyl and 2,4-dimethyl-2,4-hexadienes by AM1 and He(I) ultraviolet photoelectron spectroscopy,
Can. J. Chem., 1990, 68, 2078. [all data]
Forbes, Shilton, et al., 1964
Forbes, W.F.; Shilton, R.; Balasubramanian, A.,
The ultraviolet absorption spectra of some conjugated dienes,
J. Org. Chem., 1964, 29, 3527-3531. [all data]
Bredael, 1982
Bredael, P.,
Retention indices of hydrocarbons on SE-30,
J. Hi. Res. Chromatogr. Chromatogr. Comm., 1982, 5, 6, 325-328, https://doi.org/10.1002/jhrc.1240050610
. [all data]
Matiella and Hsieh, 1990
Matiella, J.E.; Hsieh, T.C.-Y.,
Analysis of crabmeat volatile compounds,
J. Food Sci., 1990, 55, 4, 962-966, https://doi.org/10.1111/j.1365-2621.1990.tb01575.x
. [all data]
Orav, Kailas, et al., 1999
Orav, A.; Kailas, T.; Muurisepp, M.; Kann, J.,
Composition of the oil from waste tires. 2. Fraction boiling at 160-180 0C,
Proc. Estonian Acad. Sci. Chem., 1999, 48, 3, 136-140. [all data]
Chupalov and Zenkevich, 1996
Chupalov, A.A.; Zenkevich, I.G.,
Chromatographic Characterization of Structural Transformations of Organic Compounds in Diels-Alder Reaction. Aliphatic Dienes and Dienophyls,
Zh. Org. Khim., 1996, 32, 6, 675-684. [all data]
Zenkevich and Kulikova, 1993
Zenkevich, I.G.; Kulikova, S.N.,
GC-MS Analysis of Products of Reactions of Unsaturated Compounds with Dimethyl Disulfide for Determination of Position of Double Bonds C=C,
Vestnik St. Petersburg University. Ser. phys-khim., 1993, 2, 59-69. [all data]
Waggott and Davies, 1984
Waggott, A.; Davies, I.W.,
Identification of organic pollutants using linear temperature programmed retention indices (LTPRIs) - Part II, 1984, retrieved from http://dwi.defra.gov.uk/research/completed-research/reports/dwi0383.pdf. [all data]