1,4-Hexadiene, 5-methyl-
- Formula: C7H12
- Molecular weight: 96.1702
- IUPAC Standard InChIKey: VSQLAQKFRFTMNS-UHFFFAOYSA-N
- CAS Registry Number: 763-88-2
- Chemical structure:
View 3d structure (requires JavaScript / HTML 5) - Other names: 5-Methyl-1,4-hexadiene; CH2=CHCH2CH=C(CH3)2

Phase change data

Data compiled by: Thermodynamics Research Center, NIST Boulder Laboratories, Chris Muzny director
Quantity | Value | Units | Method | Reference | Comment |
---|---|---|---|---|---|
Tboil | 365.0 | K | N/A | Ferris, 1955 | Uncertainty assigned by TRC = 2. K |
Tboil | 364.9 | K | N/A | Karasev and Khabarova, 1940 | Uncertainty assigned by TRC = 2. K |

Gas phase ion energetics data

Data compiled by: Sharon G. Lias, Rhoda D. Levin, and Sherif A. Kafafi
Ionization energy determinations
IE (eV) | Method | Reference | Comment |
---|---|---|---|
8.70 | PE | Eaton and Traylor, 1974 | Vertical value |

References

Ferris, 1955
Ferris, S.W.,
Handbook of Hydrocarbons, Academic Press, New York, 1955. [all data]
Karasev and Khabarova, 1940
Karasev, K.I.; Khabarova,
Zh. Obshch. Khim., 1940, 10, 1641. [all data]
Eaton and Traylor, 1974
Eaton, D.F.; Traylor, T.G.,
Distortional stabilization in phenyl participations,
J. Am. Chem. Soc., 1974, 96, 7109. [all data]