Benzeneethanamine, N,α-dimethyl-
- Formula: C10H15N
- Molecular weight: 149.2328
- IUPAC Standard InChIKey: MYWUZJCMWCOHBA-UHFFFAOYSA-N
- CAS Registry Number: 7632-10-2
- Chemical structure:
View 3d structure (requires JavaScript / HTML 5) - Species with the same structure:
- Stereoisomers:
- Other names: Phenethylamine, N,α-dimethyl-; Deoxyephedrine; Ephedrine, deoxy-; 2-Methylamino-1-phenylpropane; Anadrex; Desoxyephedrine; N-Methylamphetamine; N-Methyl-β-phenylisopropylamin; N-Methyl-β-phenylisopropylamine; Pervertin; α-Phenyl-β-methylaminopropane; Benzenethanamine,N,α-dimethyl-; (.+/-.)-Methamphetamine; (2-Methylaminopropyl)benzene; dl-Desoxyephedrine; dl-Methamphetamin; DL-Methamphetamine; N,α-Dimethylbenzeneethanamine; N,α-Dimethylphenethylamine; N-Methyl-1-phenyl-2-propylamine; (.+/-.)-N,α-Dimethylbenzeneethanamine; (+)-Methamphetamine; Desoxyn; Methamphetamine; Methedrine; Methylamphetamine; Stimulex; Benzeneethanamine, dimethyl-; Amphetamine, methyl-; N-Methyl-1-phenyl-2-propanamine

Gas phase ion energetics data

Data compiled as indicated in comments:
LLK - Sharon G. Lias, Rhoda D. Levin, and Sherif A. Kafafi
Ionization energy determinations
IE (eV) | Method | Reference | Comment |
---|---|---|---|
8.60 ± 0.20 | PE | Domelsmith, Munchausen, et al., 1977 | Vertical value; LLK |

Kovats' RI, non-polar column, custom temperature program

Data compiled by: NIST Mass Spectrometry Data Center, William E. Wallace, director

Column type PackedPacked
Active phase OV-101SE-30
Column length (m) 2.2.
Carrier gas N2
Substrate Chromosorb W
Column diameter (mm)
Phase thickness (μm)
Program not specifiednot specified
I 1170.1170.
ReferenceMcLinden and Stenhouse, 1979Moffat, Stead, et al., 1974
Comment MSDC-RI MSDC-RI

References

Domelsmith, Munchausen, et al., 1977
Domelsmith, L.N.; Munchausen, L.L.; Houk, K.N.,
Photoelectron spectra of psychotropic drugs. 1. Phenethylamines, tryptamines, and LSD,
J. Am. Chem. Soc., 1977, 99, 4311. [all data]