Pyridine,2-(2-(2-iodophenyl))ethenyl-

Gas phase ion energetics data

Data compiled by: Sharon G. Lias, Rhoda D. Levin, and Sherif A. Kafafi

Ionization energy determinations

IE (eV) Method Reference
7.95EIGrutzmacher, Schaldach, et al., 1980

Appearance energy determinations

Ion AE (eV) Other Products MethodReferenceComment
C13H10N+8.9IEIGrutzmacher, Schaldach, et al., 1980

References

Grutzmacher, Schaldach, et al., 1980
Grutzmacher, H.-F.; Schaldach, B.; Schubert, R.; Ramana, D.V., Ion kinetic energy release as a transition state probe in intramolecular aromatic substitutions, Adv. Mass Spectrom., 1980, 8, 795. [all data]