Pyridine, 2-[2-(2-fluorophenyl)ethenyl]-(Z)
- Formula: C13H10FN
- Molecular weight: 199.2236
- IUPAC Standard InChIKey: SARWEEZYKGDDHZ-HJWRWDBZSA-N
- CAS Registry Number: 76293-38-4
- Chemical structure:
View 3d structure (requires JavaScript / HTML 5) - Stereoisomers:

Gas phase ion energetics data

Data compiled as indicated in comments:
LLK - Sharon G. Lias, Rhoda D. Levin, and Sherif A. Kafafi
Ionization energy determinations
IE (eV) | Method | Reference | Comment |
---|---|---|---|
8.18 | EI | Grutzmacher, Schaldach, et al., 1980 | LLK |
Appearance energy determinations
Ion | AE (eV) | Other Products | Method | Reference | Comment |
---|---|---|---|---|---|
C13H10N+ | 9.2 | F | EI | Grutzmacher, Schaldach, et al., 1980 | LLK |

References

Grutzmacher, Schaldach, et al., 1980
Grutzmacher, H.-F.; Schaldach, B.; Schubert, R.; Ramana, D.V.,
Ion kinetic energy release as a transition state probe in intramolecular aromatic substitutions,
Adv. Mass Spectrom., 1980, 8, 795. [all data]