Formic acid, 1,1-dimethylethyl ester
- Formula: C5H10O2
- Molecular weight: 102.1317
- IUPAC Standard InChIKey: RUPAXCPQAAOIPB-UHFFFAOYSA-N
- CAS Registry Number: 762-75-4
- Chemical structure:

Phase change data

Data compiled as indicated in comments:
BS - Robert L. Brown and Stephen E. Stein
TRC - Thermodynamics Research Center, NIST Boulder Laboratories, Chris Muzny director
ALS - Hussein Y. Afeefy, Joel F. Liebman, and Stephen E. Stein
DRB - Donald R. Burgess, Jr.
Quantity | Value | Units | Method | Reference | Comment |
---|---|---|---|---|---|
Tboil | 355.7 | K | N/A | Aldrich Chemical Company Inc., 1990 | BS |
Tboil | 356.15 | K | N/A | Young and Pare, 1958 | Uncertainty assigned by TRC = 1. K; TRC |
Tboil | 356.0 | K | N/A | Barkenbus, Naff, et al., 1954 | Uncertainty assigned by TRC = 1.5 K; TRC |
Quantity | Value | Units | Method | Reference | Comment |
ΔvapH° | 8.7 ± 1.0 | kcal/mol | E | Guthrie, 1977 | Hydrolysis; ALS |
ΔvapH° | 8.65 | kcal/mol | N/A | Guthrie, 1977 | DRB |

Gas phase ion energetics data

Data compiled by: Sharon G. Lias and Joel F. Liebman
Appearance energy determinations
Ion | AE (eV) | Other Products | Method | Reference | Comment |
---|---|---|---|---|---|
CHO2+ | 10.42 | C4H9 | EI | Holmes, Lossing, et al., 1991 |

References

Aldrich Chemical Company Inc., 1990
Aldrich Chemical Company Inc.,
Catalog Handbook of Fine Chemicals, Aldrich Chemical Company, Inc., Milwaukee WI, 1990, 1. [all data]
Young and Pare, 1958
Young, D.; Pare, E.,
J. Org. Chem., 1958, 23, 1772. [all data]
Barkenbus, Naff, et al., 1954
Barkenbus, C.; Naff, M.B.; Rapp, K.E.,
The Preparation and Properties of Some tert-Alkyl Formates,
J. Org. Chem., 1954, 19, 1316. [all data]
Guthrie, 1977
Guthrie, J.P.,
Cyclization of glycol monoesters to give hemiorthoesters: a test of the thermochemical method for determining free energies of tetrahedral intermediates,
Can. J. Chem., 1977, 55, 3562-3574. [all data]
Holmes, Lossing, et al., 1991
Holmes, J.L.; Lossing, F.P.; Mayer, P.M.,
Heats of formation of oxygen-containing organic free radicals from appearance energy measurements,
J. Am. Chem. Soc., 1991, 113, 9723. [all data]