Stannane, trimethyl-2-propenyl-
- Formula: C6H14Sn
- Molecular weight: 204.885
- IUPAC Standard InChIKey: IYYAXTUFJCBGQP-UHFFFAOYSA-N
- CAS Registry Number: 762-73-2
- Chemical structure:
View 3d structure (requires JavaScript / HTML 5) - Permanent link for this species. Use this link for bookmarking this species for future reference.

Gas phase ion energetics data

Data compiled as indicated in comments:
LLK - Sharon G. Lias, Rhoda D. Levin, and Sherif A. Kafafi
RDSH - Henry M. Rosenstock, Keith Draxl, Bruce W. Steiner, and John T. Herron
Ionization energy determinations
IE (eV) | Method | Reference | Comment |
---|---|---|---|
8.50 | PE | Schweig, Weidner, et al., 1974 | Vertical value; LLK |
8.70 | PE | Brown, Eaton, et al., 1974 | Vertical value; LLK |
Appearance energy determinations
Ion | AE (eV) | Other Products | Method | Reference | Comment |
---|---|---|---|---|---|
C3H9Sn+ | 8.68 ± 0.02 | ? | EI | Yergey and Lampe, 1968 | RDSH |
C5H11Sn+ | 9.43 ± 0.20 | CH3 | EI | Yergey and Lampe, 1968 | RDSH |

References

Schweig, Weidner, et al., 1974
Schweig, A.; Weidner, U.; Manuel, G.,
Theory and application of photoelectron spectroscopy. XLIV. A quantitative account of hyperconjugation in allyl and benzyl compounds of elements of Group IVB,
J. Organomet. Chem., 1974, 67, 4. [all data]
Brown, Eaton, et al., 1974
Brown, R.S.; Eaton, D.F.; Hosomi, A.; Traylor, T.G.; Wright, J.M.,
Photoelectron spectra of cyclopropylcarbinyltrimethyltin and allyltrimethyltin. A comparison of σ-σ and σ-π conjugation,
J. Organomet. Chem., 1974, 66, 249. [all data]
Yergey and Lampe, 1968
Yergey, A.L.; Lampe, F.W.,
An electron impact study of ionization and dissociation of trimethylstannanes,
J. Organometal. Chem., 1968, 15, 339. [all data]