1-Pentene, 4,4-dimethyl-
- Formula: C7H14
- Molecular weight: 98.1861
- IUPAC Standard InChIKey: KLCNJIQZXOQYTE-UHFFFAOYSA-N
- CAS Registry Number: 762-62-9
- Chemical structure:
View 3d structure (requires JavaScript / HTML 5) - Other names: 2,2-Dimethyl-4-pentene; 4,4-Dimethyl-1-pentene; (CH3)3CCH2CH=CH2; 4,4-dimethylpent-1-ene

Condensed phase thermochemistry data

Data compiled by: Hussein Y. Afeefy, Joel F. Liebman, and Stephen E. Stein
Quantity | Value | Units | Method | Reference | Comment |
---|---|---|---|---|---|
ΔcH°liquid | -4644.8 ± 1.7 | kJ/mol | Ccb | Rockenfeller and Rossini, 1961 | Derived from the ratio of Heat of combustion; Corresponding ΔfHºliquid = -110.6 kJ/mol (simple calculation by NIST; no Washburn corrections) |

Phase change data

Data compiled as indicated in comments:
BS - Robert L. Brown and Stephen E. Stein
TRC - Thermodynamics Research Center, NIST Boulder Laboratories, Chris Muzny director
AC - William E. Acree, Jr., James S. Chickos
ALS - Hussein Y. Afeefy, Joel F. Liebman, and Stephen E. Stein
Quantity | Value | Units | Method | Reference | Comment |
---|---|---|---|---|---|
Tboil | 345.3 ± 0.8 | K | AVG | N/A | Average of 16 values; Individual data points |
Quantity | Value | Units | Method | Reference | Comment |
Tfus | 136.4 ± 0.6 | K | AVG | N/A | Average of 8 values; Individual data points |
Quantity | Value | Units | Method | Reference | Comment |
ΔvapH° | 31.2 | kJ/mol | N/A | Reid, 1972 | AC |
ΔvapH° | 31.2 | kJ/mol | V | Camin and Rossini, 1960 | ALS |
Enthalpy of vaporization
ΔvapH (kJ/mol) | Temperature (K) | Method | Reference | Comment |
---|---|---|---|---|
31.0 | 314. | A | Stephenson and Malanowski, 1987 | Based on data from 299. to 347. K.; AC |
31.0 | 315. | MM | Camin and Rossini, 1960, 2 | Based on data from 290. to 346. K.; AC |

Reaction thermochemistry data

Data compiled by: Hussein Y. Afeefy, Joel F. Liebman, and Stephen E. Stein
Individual Reactions
By formula: H2 + C7H14 = C7H16
Quantity | Value | Units | Method | Reference | Comment |
---|---|---|---|---|---|
ΔrH° | -122.6 ± 0.6 | kJ/mol | Chyd | Rogers and Dejroongruang, 1989 | liquid phase; solvent: Cyclohexane |
ΔrH° | -122.5 ± 0.42 | kJ/mol | Chyd | Dolliver, Gresham, et al., 1937 | gas phase; Reanalyzed by Cox and Pilcher, 1970, Original value = -123.56 ± 0.63 kJ/mol; At 355 °K |

Gas phase ion energetics data

Data compiled as indicated in comments:
LLK - Sharon G. Lias, Rhoda D. Levin, and Sherif A. Kafafi
Ionization energy determinations
IE (eV) | Method | Reference | Comment |
---|---|---|---|
9.399 ± 0.003 | PE | Masclet, Grosjean, et al., 1973 | LLK |
9.6 | PE | Weidner and Schweig, 1972 | Vertical value; LLK |

Kovats' RI, non-polar column, isothermal

Column type | Active phase | Temperature (C) | I | Reference | Comment |
---|---|---|---|---|---|
Capillary | Methyl Silicone | 30. | 610.4 | Soják, Addová, et al., 2002 | He; Column length: 150. m; Column diameter: 0.250 mm |
Capillary | Squalane | 30. | 602.3 | Soják, Addová, et al., 2002 | He; Column length: 93. m; Column diameter: 0.250 mm |
Capillary | Squalane | 25. | 603. | Hilal, Carreira, et al., 1994 | |
Capillary | OV-101 | 40. | 614. | Laub and Purnell, 1988 | |
Capillary | OV-101 | 60. | 615. | Laub and Purnell, 1988 | |
Capillary | OV-101 | 80. | 617. | Laub and Purnell, 1988 | |
Capillary | OV-101 | 50. | 614.5 | Boneva and Dimov, 1986 | 100. m/0.27 mm/0.9 μm, N2 |
Capillary | OV-101 | 70. | 615.9 | Boneva and Dimov, 1986 | 100. m/0.27 mm/0.9 μm, N2 |
Capillary | Squalane | 50. | 604.9 | Boneva and Dimov, 1986 | N2; Column length: 100. m; Column diameter: 0.25 mm |
Capillary | Squalane | 70. | 606.6 | Boneva and Dimov, 1986 | N2; Column length: 100. m; Column diameter: 0.25 mm |
Capillary | DB-1 | 40. | 611. | Lubeck and Sutton, 1984 | 60. m/0.264 mm/0.25 μm, H2 |
Capillary | HP-PONA | 40. | 611. | Lubeck and Sutton, 1984 | 50. m/0.21 mm/0.5 μm, H2 |
Packed | Squalane | 80. | 608. | Chrétien and Dubois, 1977 | |
Capillary | Squalane | 50. | 605. | Chretien and Dubois, 1976 | |
Capillary | Squalane | 50. | 605. | Rijks and Cramers, 1974 | N2; Column length: 100. m; Column diameter: 0.25 mm |
Capillary | Squalane | 70. | 606. | Rijks and Cramers, 1974 | N2; Column length: 100. m; Column diameter: 0.25 mm |
Capillary | Squalane | 40. | 605. | Matukuma, 1969 | N2; Column length: 91.4 m; Column diameter: 0.25 mm |
Packed | Squalane | 27. | 603. | Hively and Hinton, 1968 | He, Chromosorb P; Column length: 15. m; Column diameter: 0.25 mm |
Packed | Squalane | 49. | 605. | Hively and Hinton, 1968 | He, Chromosorb P; Column length: 15. m; Column diameter: 0.25 mm |
Packed | Squalane | 67. | 607. | Hively and Hinton, 1968 | He, Chromosorb P; Column length: 15. m; Column diameter: 0.25 mm |
Packed | Squalane | 86. | 609. | Hively and Hinton, 1968 | He, Chromosorb P; Column length: 15. m; Column diameter: 0.25 mm |

Van Den Dool and Kratz RI, non-polar column, temperature ramp

Column type | Active phase | I | Reference | Comment |
---|---|---|---|---|
Capillary | Methyl Silicone | 611.0 | Soják, Addová, et al., 2002 | He, 1. K/min; Column length: 150. m; Column diameter: 0.250 mm; Tstart: 30. C; Tend: 200. C |
Capillary | DB-1 | 610. | Kaiser and Siegl, 1994 | 60. m/0.32 mm/1. μm, -50. C @ 4. min, 6. K/min; Tend: 180. C |
Capillary | Ultra-1 | 610. | Olson, Sinkevitch, et al., 1992 | 4. K/min; Tstart: -40. C; Tend: 230. C |
Capillary | Petrocol DH | 608. | White, Hackett, et al., 1992 | 100. m/0.25 mm/0.5 μm, He, 1. K/min; Tstart: 30. C; Tend: 220. C |

Normal alkane RI, non-polar column, isothermal

Column type | Active phase | Temperature (C) | I | Reference | Comment |
---|---|---|---|---|---|
Capillary | Squalane | 40. | 603.4 | Sojak, Addova, et al., 2000 | He; Column length: 93. m; Column diameter: 0.25 mm |
Capillary | Methyl Silicone | 50. | 605. | N/A | N2; Column length: 74.6 m; Column diameter: 0.28 mm |
Capillary | Squalane | 60. | 607. | Lehmkuhl, Olbrysch, et al., 1975 | Nitrogen; Column length: 100. m |
Capillary | Squalane | 70. | 606. | Schomburg, 1966 |

Normal alkane RI, non-polar column, temperature ramp

Column type | Active phase | I | Reference | Comment |
---|---|---|---|---|
Capillary | Polydimethyl siloxane: CP-Sil 5 CB | 614. | Bramston-Cook, 2013 | 60. m/0.25 mm/1.0 μm, Helium, 45. C @ 1.45 min, 3.6 K/min, 210. C @ 2.72 min |
Capillary | Petrocol DH | 607. | Supelco, 2012 | 100. m/0.25 mm/0.50 μm, Helium, 20. C @ 15. min, 15. K/min, 220. C @ 30. min |
Capillary | PONA | 611. | Zhang, Ding, et al., 2009 | 50. m/0.20 mm/0.50 μm, Nitrogen, 35. C @ 15. min, 2. K/min, 200. C @ 10. min |
Capillary | SE-54 | 609. | Guan, Li, et al., 1995 | 60. C @ 2. min, 4. K/min; Column length: 50. m; Column diameter: 0.32 mm; Tend: 200. C |

Normal alkane RI, non-polar column, custom temperature program

Column type | Active phase | I | Reference | Comment |
---|---|---|---|---|
Capillary | Methyl Silicone | 608. | Chen and Feng, 2007 | Program: not specified |
Capillary | Polydimethyl siloxane | 608. | Junkes, Castanho, et al., 2003 | Program: not specified |

References

Rockenfeller and Rossini, 1961
Rockenfeller, J.D.; Rossini, F.D.,
Heats of combustion, isomerization, and formation of selected C7, C8, and C10 monoolefin hydrocarbons,
J. Phys. Chem., 1961, 65, 267-272. [all data]
Reid, 1972
Reid, Robert C.,
Handbook on vapor pressure and heats of vaporization of hydrocarbons and related compounds, R. C. Wilhort and B. J. Zwolinski, Texas A Research Foundation. College Station, Texas(1971). 329 pages.$10.00,
AIChE J., 1972, 18, 6, 1278-1278, https://doi.org/10.1002/aic.690180637
. [all data]
Camin and Rossini, 1960
Camin, D.L.; Rossini, F.D.,
Physical properties of to selected C7 and C8 alkene hydrocarbons,
J. Chem. Eng. Data, 1960, 5, 368. [all data]
Stephenson and Malanowski, 1987
Stephenson, Richard M.; Malanowski, Stanislaw,
Handbook of the Thermodynamics of Organic Compounds, 1987, https://doi.org/10.1007/978-94-009-3173-2
. [all data]
Camin and Rossini, 1960, 2
Camin, D.L.; Rossini, F.D.,
Physical Properties of 16 Selected C 7 and C 8 Alkene Hydrocarbons.,
J. Chem. Eng. Data, 1960, 5, 3, 368-372, https://doi.org/10.1021/je60007a037
. [all data]
Rogers and Dejroongruang, 1989
Rogers, D.W.; Dejroongruang, K.,
Enthalpies of hydrogenation of the dimethylpentenes, ethylpentenes, methylbutene, and trimethylbutene,
J. Chem. Thermodyn., 1989, 21, 1115-1120. [all data]
Dolliver, Gresham, et al., 1937
Dolliver, M.a.; Gresham, T.L.; Kistiakowsky, G.B.; Vaughan, W.E.,
Heats of organic reactions. V. Heats of hydrogenation of various hydrocarbons,
J. Am. Chem. Soc., 1937, 59, 831-841. [all data]
Cox and Pilcher, 1970
Cox, J.D.; Pilcher, G.,
Thermochemistry of Organic and Organometallic Compounds, Academic Press, New York, 1970, 1-636. [all data]
Masclet, Grosjean, et al., 1973
Masclet, P.; Grosjean, D.; Mouvier, G.,
Alkene ionization potentials. Part I. Quantitative determination of alkyl group structural effects,
J. Electron Spectrosc. Relat. Phenom., 1973, 2, 225. [all data]
Weidner and Schweig, 1972
Weidner, U.; Schweig, A.,
Theory and application of photoelectron spectroscopy. V. The nature of bonding in vinyl- and allylsilanes: the effects of σ-π (hyperconjugation) pπ-dπ conjugation in these compounds,
J. Organomet. Chem., 1972, 39, 261. [all data]
Soják, Addová, et al., 2002
Soják, L.; Addová, G.; Kubinec, R.; Kraus, A.; Hu, G.,
Gas chromatographic-mass spectrometric characterization of all acyclic C5-C7 alkenes from fluid catalytic cracked gasoline using polydimethylsiloxane and squalane stationary phases,
J. Chromatogr. A, 2002, 947, 1, 103-117, https://doi.org/10.1016/S0021-9673(01)01564-3
. [all data]
Hilal, Carreira, et al., 1994
Hilal, S.H.; Carreira, L.A.; Karickhoff, S.W.; Melton, C.M.,
Estimation of Gas-Liquid Chromatographic Retention Times from Molecular Structure,
J. Chromatogr. A, 1994, 662, 2, 269-280, https://doi.org/10.1016/0021-9673(94)80515-6
. [all data]
Laub and Purnell, 1988
Laub, R.J.; Purnell, J.H.,
Specific retention volumes, retention indices, and family-plot regressions of aliphatic, alicyclic, and aromatic hydrocarbon solutes with OV-101 poly (dimethylsiloxane) stationary phase,
J. Hi. Res. Chromatogr. Chromatogr. Comm., 1988, 11, 9, 649-660, https://doi.org/10.1002/jhrc.1240110908
. [all data]
Boneva and Dimov, 1986
Boneva, S.; Dimov, N.,
Gas Chromatographic Retention Indices for Alkenes on OV-101 and Squalane Capillary Columns,
Chromatographia, 1986, 21, 3, 149-151, https://doi.org/10.1007/BF02311743
. [all data]
Lubeck and Sutton, 1984
Lubeck, A.J.; Sutton, D.L.,
Kovats Retention Indices of Selected Olefins on Bonded Phase Fused Silica Capillaries,
J. Hi. Res. Chromatogr. Chromatogr. Comm., 1984, 7, 9, 542-544, https://doi.org/10.1002/jhrc.1240070913
. [all data]
Chrétien and Dubois, 1977
Chrétien, J.R.; Dubois, J.E.,
Topological analysis of gas-liquid chromatographic behavior of alkenes,
Anal. Chem., 1977, 49, 6, 747-756, https://doi.org/10.1021/ac50014a021
. [all data]
Chretien and Dubois, 1976
Chretien, J.R.; Dubois, J.-E.,
New Perspectives in the Prediction of Kovats Indices,
J. Chromatogr., 1976, 126, 171-189, https://doi.org/10.1016/S0021-9673(01)84071-1
. [all data]
Rijks and Cramers, 1974
Rijks, J.A.; Cramers, C.A.,
High precision capillary gas chromatography of hydrocarbons,
Chromatographia, 1974, 7, 3, 99-106, https://doi.org/10.1007/BF02269819
. [all data]
Matukuma, 1969
Matukuma, A.,
Retention indices of alkanes through C10 and alkenes through C8 and relation between boiling points and retention data,
Gas Chromatogr., Int. Symp. Anal. Instrum. Div Instrum Soc. Amer., 1969, 7, 55-75. [all data]
Hively and Hinton, 1968
Hively, R.A.; Hinton, R.E.,
Variation of the retention index with temperature on squalane substrates,
J. Gas Chromatogr., 1968, 6, 4, 203-217, https://doi.org/10.1093/chromsci/6.4.203
. [all data]
Kaiser and Siegl, 1994
Kaiser, E.W.; Siegl, W.O.,
High resolution gas chromatographic determination of the atmospheric reactivity of engine-out hydrocarbon emissions from a spark-ignited engine,
J. Hi. Res. Chromatogr., 1994, 17, 4, 264-270, https://doi.org/10.1002/jhrc.1240170414
. [all data]
Olson, Sinkevitch, et al., 1992
Olson, K.L.; Sinkevitch, R.M.; Sloane, T.M.,
Speciation and Quantitation of Hydrocarbons in Gasoline Engine Exhaust,
J. Chromatogr. Sci., 1992, 30, 12, 500-508, https://doi.org/10.1093/chromsci/30.12.500
. [all data]
White, Hackett, et al., 1992
White, C.M.; Hackett, J.; Anderson, R.R.; Kail, S.; Spock, P.S.,
Linear temperature programmed retention indices of gasoline range hydrocarbons and chlorinated hydrocarbons on cross-linked polydimethylsiloxane,
J. Hi. Res. Chromatogr., 1992, 15, 2, 105-120, https://doi.org/10.1002/jhrc.1240150211
. [all data]
Sojak, Addova, et al., 2000
Sojak, L.; Addova, G.; Kubinec, R.; Ruman, J.; Hu, G.,
GC-MS characterization of all acyclic C5-C7 alkenes from FCC gasoline using squalane stationary phase,
Petroleum and Coal, 2000, 42, 3-4, 188-194. [all data]
Lehmkuhl, Olbrysch, et al., 1975
Lehmkuhl, H.; Olbrysch, O.; Reinehr, D.; Schomburg, G.; Henneberg, D.,
Vergleich der Additionsrichtungen von tert.-Butyl und Isopropylverbindungen des Magnesiums, Aluminiums and Lithiums an 1-Alkene,
Liebigs Ann. Chem., 1975, 1975, 1, 145-159, https://doi.org/10.1002/jlac.197519750114
. [all data]
Schomburg, 1966
Schomburg, G.,
Gaschromatographische Retentionsdaten und Struktur Chemischer Verbindungen. II. Methylverzweigungen und Doppelbindungen in Offenkettigen Kohlenwasserstoffen,
J. Chromatogr., 1966, 23, 1-17, https://doi.org/10.1016/S0021-9673(01)98652-2
. [all data]
Bramston-Cook, 2013
Bramston-Cook, R.,
Kovats indices for C2-C13 hydrocarbons and selected oxygenated/halocarbons with 100 % dimethylpolysiloxane columns, 2013, retrieved from http://lotusinstruments.com/monographs/List .... [all data]
Supelco, 2012
Supelco, CatalogNo. 24160-U,
Petrocol DH Columns. Catalog No. 24160-U, 2012, retrieved from http://www.sigmaaldrich.com/etc/medialib/docs/Supelco/Datasheet/1/w97949.Par.0001.File.tmp/w97949.pdf. [all data]
Zhang, Ding, et al., 2009
Zhang, X.; Ding, L.; Sun, Z.; Song, L.; Sun, T.,
Study on quantitative structure-retention relationships for hydrocarbons in FCC gasoline,
Chromatographia, 2009, 70, 3/4, 511-518, https://doi.org/10.1365/s10337-009-1174-0
. [all data]
Guan, Li, et al., 1995
Guan, Y.; Li, L.; Zhou, L.,
Live retention database for compound identification in capillary gas chromatography,
Chin. J. Chromatogr., 1995, 13, 5, 851-857. [all data]
Chen and Feng, 2007
Chen, Y.; Feng, C.,
QSPR study on gas chromatography retention index of some organic pollutants,
Comput. Appl. Chem. (China), 2007, 24, 10, 1404-1408. [all data]
Junkes, Castanho, et al., 2003
Junkes, B.S.; Castanho, R.D.M.; Amboni, C.; Yunes, R.A.; Heinzen, V.E.F.,
Semiempirical Topological Index: A Novel Molecular Descriptor for Quantitative Structure-Retention Relationship Studies,
Internet Electronic Journal of Molecular Design, 2003, 2, 1, 33-49. [all data]