Hydroperoxide, 1-methylhexyl
- Formula: C7H16O2
- Molecular weight: 132.2007
- IUPAC Standard InChIKey: FWELUXZVATZEMI-UHFFFAOYSA-N
- CAS Registry Number: 762-46-9
- Chemical structure:
View 3d structure (requires JavaScript / HTML 5) - Other names: n-C5H11CH(CH3)OOH

Condensed phase thermochemistry data

Data compiled by: Hussein Y. Afeefy, Joel F. Liebman, and Stephen E. Stein
Quantity | Value | Units | Method | Reference | Comment |
---|---|---|---|---|---|
ΔcH°liquid | -4695. ± 2. | kJ/mol | Ccb | Pritzkow and Muller, 1956 | Corresponding ΔfHºliquid = -346. kJ/mol (simple calculation by NIST; no Washburn corrections) |

Gas phase ion energetics data

Data compiled as indicated in comments:
LLK - Sharon G. Lias, Rhoda D. Levin, and Sherif A. Kafafi
RDSH - Henry M. Rosenstock, Keith Draxl, Bruce W. Steiner, and John T. Herron
Ionization energy determinations
IE (eV) | Method | Reference | Comment |
---|---|---|---|
9.30 ± 0.03 | PE | Ashmore and Burgess, 1977 | LLK |
9.94 | PE | Ashmore and Burgess, 1977 | Vertical value; LLK |
Appearance energy determinations
Ion | AE (eV) | Other Products | Method | Reference | Comment |
---|---|---|---|---|---|
C7H15+ | 9.7 ± 0.1 | ? | EI | Burgess, SenSharma, et al., 1968 | RDSH |
C7H15O+ | 9.7 ± 0.1 | OH | EI | Burgess, SenSharma, et al., 1968 | RDSH |
C7H15O2+ | 10.7 ± 0.1 | H | EI | Burgess, SenSharma, et al., 1968 | RDSH |

References

Pritzkow and Muller, 1956
Pritzkow, W.; Muller, K.A.,
Uber die energetische stellung der organischen hydroperoxyde und die o-o-bindungsenergie,
Chem. Ber., 1956, 89, 2318-2321. [all data]
Ashmore and Burgess, 1977
Ashmore, F.S.; Burgess, A.R.,
Study of Some Medium Size Alcohols and Hydroperoxides by Photoelectron Spectroscopy,
J. Chem. Soc. Faraday Trans. 2, 1977, 73, 1247. [all data]
Burgess, SenSharma, et al., 1968
Burgess, A.R.; SenSharma, D.K.; White, M.J.D.,
The mass spectrometry of some alkyl peroxy radicals and related alkyl hydroperoxides,
Advan. Mass Spectrom., 1968, 4, 345. [all data]