2-Butynedioic acid, dimethyl ester
- Formula: C6H6O4
- Molecular weight: 142.1094
- IUPAC Standard InChIKey: VHILMKFSCRWWIJ-UHFFFAOYSA-N
- CAS Registry Number: 762-42-5
- Chemical structure:
View 3d structure (requires JavaScript / HTML 5) - Other names: Acetylenedicarboxylic acid, dimethyl ester; Bis(methoxycarbonyl)acetylene; Dimethyl acetylenedicarboxylate; Dimethyl butynedioate; Dimethyl 2-butynedioate; Methyl acetylenedicarboxylate; 1,2-Bis(methoxycarbonyl)acetylene; Dimethyl acetylenedicarboxylic acid; Dimethyl 1,2-acetylenedicarboxylate; Dimethyl butyne-1,4-dioate; Dimethyl ethynedicarboxylate; 1,2-Bis(methoxycarbonyl)ethyne; Butynedioic acid dimethyl ester; Bis(carbomethoxy)acetylene; Di(carbomethoxy)acetylene; But-2-ynedioic acid dimethyl ester; 2-Butynedioic acid, 1,4-dimethyl ester; NSC 14912

Phase change data

Data compiled by: Robert L. Brown and Stephen E. Stein
Reduced pressure boiling point
Tboil (K) | Pressure (bar) | Reference |
---|---|---|
369.7 | 0.025 | Aldrich Chemical Company Inc., 1990 |

Gas phase ion energetics data

Data compiled by: Sharon G. Lias, Rhoda D. Levin, and Sherif A. Kafafi
Ionization energy determinations
IE (eV) | Method | Reference | Comment |
---|---|---|---|
10.9 | PE | Sustmann and Trill, 1972 | Vertical value |

References

Aldrich Chemical Company Inc., 1990
Aldrich Chemical Company Inc.,
Catalog Handbook of Fine Chemicals, Aldrich Chemical Company, Inc., Milwaukee WI, 1990, 1. [all data]
Sustmann and Trill, 1972
Sustmann, R.; Trill, H.,
Photoelektronenspektroskopische Bestimmung von Substituenten-Effekten. II. α,β-ungesattigte Carbonester,
Tetrahedron Lett., 1972, 42, 4271. [all data]