Camphor
- Formula: C10H16O
- Molecular weight: 152.2334
- IUPAC Standard InChIKey: DSSYKIVIOFKYAU-UHFFFAOYSA-N
- CAS Registry Number: 76-22-2
- Chemical structure:
- Stereoisomers:
- Other names: Bicyclo[2.2.1]heptan-2-one, 1,7,7-trimethyl-; Root bark oil; Spirit of camphor; 1,7,7-Trimethylbicyclo[2.2.1]-2-heptanone; 1,7,7-Trimethylnorcamphor; 2-Bornanone; 2-Camphanone; 1,7,7-Trimethyl-bicyclo[2.2.1]heptan-2-one; 2-Camphonone; Gum camphor; Bornane, 2-oxo-; Camphor, synthetic; Huile de camphre; 2-Kamfanon; Kampfer; 2-Keto-1,7,7-trimethylnorcamphane; Matricaria camphor; Norcamphor, 1,7,7-trimethyl-; UN 2717; Bicyclo[2.2.1]heptane-2-one, 1,7,7-trimethyl-; Alphanon; DL-Camphor; Borneo camphor; Bicyclo[2.2.1]heptan-2-one, 1,7,7-trimethyl-, (.+/-.)-; (.+/-.)-Camphor; Camphre; bornan-2-one

Gas phase thermochemistry data

Data compiled by: Hussein Y. Afeefy, Joel F. Liebman, and Stephen E. Stein
Quantity | Value | Units | Method | Reference | Comment |
---|---|---|---|---|---|
ΔfH°gas | -267. ± 3. | kJ/mol | Ccb | Steele, 1977 |

Condensed phase thermochemistry data

Data compiled as indicated in comments:
ALS - Hussein Y. Afeefy, Joel F. Liebman, and Stephen E. Stein
DH - Eugene S. Domalski and Elizabeth D. Hearing
Quantity | Value | Units | Method | Reference | Comment |
---|---|---|---|---|---|
ΔfH°solid | -319. ± 3. | kJ/mol | Ccb | Steele, 1977 | ALS |
ΔfH°solid | -399. ± 66. | kJ/mol | Ccb | Delafontaine, Sabbah, et al., 1973 | %hf298 calculated possible error by the authors; ALS |
Quantity | Value | Units | Method | Reference | Comment |
ΔcH°solid | -5902. ± 3. | kJ/mol | Ccb | Steele, 1977 | Corresponding ΔfHºsolid = -319. kJ/mol (simple calculation by NIST; no Washburn corrections); ALS |
ΔcH°solid | -5822. ± 66. | kJ/mol | Ccb | Delafontaine, Sabbah, et al., 1973 | %hf298 calculated possible error by the authors; Corresponding ΔfHºsolid = -400. kJ/mol (simple calculation by NIST; no Washburn corrections); ALS |
ΔcH°solid | -5891.2 | kJ/mol | Ccb | Shchukarev and Shchukareva, 1932 | Corresponding ΔfHºsolid = -330.5 kJ/mol (simple calculation by NIST; no Washburn corrections); ALS |
ΔcH°solid | -5898.6 ± 3.8 | kJ/mol | Ccb | Swietoslawski and Bobinska, 1929 | Corresponding ΔfHºsolid = -323. kJ/mol (simple calculation by NIST; no Washburn corrections); ALS |
ΔcH°solid | -5910.7 | kJ/mol | Ccb | Roth and Ostling, 1913 | Corresponding ΔfHºsolid = -311. kJ/mol (simple calculation by NIST; no Washburn corrections); ALS |
Constant pressure heat capacity of solid
Cp,solid (J/mol*K) | Temperature (K) | Reference | Comment |
---|---|---|---|
271.2 | 298.1 | Frandsen, 1931 | T = 307 to 483 K.; DH |

Phase change data

Data compiled as indicated in comments:
TRC - Thermodynamics Research Center, NIST Boulder Laboratories, Chris Muzny director
AC - William E. Acree, Jr., James S. Chickos
ALS - Hussein Y. Afeefy, Joel F. Liebman, and Stephen E. Stein
DH - Eugene S. Domalski and Elizabeth D. Hearing
Quantity | Value | Units | Method | Reference | Comment |
---|---|---|---|---|---|
Tboil | 482.3 | K | N/A | Lecat, 1947 | Uncertainty assigned by TRC = 1. K; TRC |
Tboil | 482.25 | K | N/A | Lecat, 1943 | Uncertainty assigned by TRC = 0.3 K; TRC |
Tboil | 482.25 | K | N/A | Lecat, 1943, 2 | Uncertainty assigned by TRC = 0.5 K; TRC |
Quantity | Value | Units | Method | Reference | Comment |
Tfus | 449. | K | N/A | Mjojo, 1979 | Crystal phase 1 phase; Uncertainty assigned by TRC = 1. K; TRC |
Tfus | 451.5 | K | N/A | Frandsen, 1931, 2 | Uncertainty assigned by TRC = 0.1 K; TRC |
Quantity | Value | Units | Method | Reference | Comment |
ΔvapH° | 54.4 | kJ/mol | CGC | Chickos, Hosseini, et al., 1995 | Based on data from 343. to 383. K.; AC |
ΔvapH° | 54.5 | kJ/mol | CGC | Chickos, Hosseini, et al., 1995 | Based on data from 343. to 383. K.; AC |
ΔvapH° | 55.2 | kJ/mol | CGC | Chickos, Hosseini, et al., 1995 | Based on data from 343. to 383. K.; AC |
Quantity | Value | Units | Method | Reference | Comment |
ΔsubH° | 51.9 ± 0.8 | kJ/mol | V | Steele, 1977 | ALS |
Antoine Equation Parameters
log10(P) = A − (B / (T + C))
P = vapor pressure (bar)
T = temperature (K)
View plot Requires a JavaScript / HTML 5 canvas capable browser.
Temperature (K) | A | B | C | Reference | Comment |
---|---|---|---|---|---|
451.20 to 505.50 | 3.30967 | 1096.291 | -148.579 | de Wilde, 1937 | Coefficents calculated by NIST from author's data. |
Enthalpy of sublimation
ΔsubH (kJ/mol) | Temperature (K) | Method | Reference | Comment |
---|---|---|---|---|
51.5 ± 2.6 | 283. | HSA | Chickos, 1975 | Based on data from 273. to 293. K.; AC |
53.6 | 363. | N/A | Jones, 1960 | Based on data from 273. to 453. K.; AC |
54.7 | 301. | N/A | Sherwood and Bryant, 1957 | Based on data from 285. to 318. K.; AC |
Enthalpy of fusion
ΔfusH (kJ/mol) | Temperature (K) | Reference | Comment |
---|---|---|---|
6.820 | 451.5 | Frandsen, 1931 | DH |
Entropy of fusion
ΔfusS (J/mol*K) | Temperature (K) | Reference | Comment |
---|---|---|---|
15.10 | 451.5 | Frandsen, 1931 | DH |

Reaction thermochemistry data

Data compiled by: Hussein Y. Afeefy, Joel F. Liebman, and Stephen E. Stein
Individual Reactions
By formula: C12H22O2 + H2O = 2CH4O + C10H16O
Quantity | Value | Units | Method | Reference | Comment |
---|---|---|---|---|---|
ΔrH° | 7.73 ± 0.36 | kJ/mol | Cm | Wiberg and Cunningham, 1990 | liquid phase; Heat of hydrolysis |

Gas phase ion energetics data

Data evaluated as indicated in comments:
HL - Edward P. Hunter and Sharon G. Lias
Data compiled as indicated in comments:
RDSH - Henry M. Rosenstock, Keith Draxl, Bruce W. Steiner, and John T. Herron
Quantity | Value | Units | Method | Reference | Comment |
---|---|---|---|---|---|
Proton affinity (review) | 859.2 | kJ/mol | N/A | Hunter and Lias, 1998 | HL |
Quantity | Value | Units | Method | Reference | Comment |
Gas basicity | 827.3 | kJ/mol | N/A | Hunter and Lias, 1998 | HL |
Ionization energy determinations
IE (eV) | Method | Reference | Comment |
---|---|---|---|
8.76 ± 0.03 | PI | Vilesov, 1960 | RDSH |

Van Den Dool and Kratz RI, polar column, temperature ramp

Data compiled by: NIST Mass Spectrometry Data Center, William E. Wallace, director

Column type CapillaryCapillaryCapillaryCapillaryCapillary
Active phase HP-InnowaxHP-20MRTX-WaxRTX-WaxHP-20M
Column length (m) 30.50.60.60.50.
Carrier gas HeHeHeHeHelium
Substrate
Column diameter (mm) 0.250.20.220.220.20
Phase thickness (μm) 0.250.20.250.250.20
Tstart (C) 60.70.60.60.70.
Tend (C) 280.180.230.230.180.
Heat rate (K/min) 3.4.2.2.4.
Initial hold (min)  4.  4.
Final hold (min)  10.30.35.15.
I 1531.1475.1492.1510.1475.
ReferenceKundakovic, Fokialakis, et al., 2007Maksimovic, Vidic, et al., 2007Muselli, Rossi, et al., 2007Paolini J., Costa J., et al., 2007Politeo, Jukic, et al., 2007
Comment MSDC-RI MSDC-RI MSDC-RI MSDC-RI MSDC-RI
Column type CapillaryCapillaryCapillaryCapillaryCapillary
Active phase HP-20MBP-20BP-20Polyethylene GlycolBP-20
Column length (m) 50.50.50.30.50.
Carrier gas HeHeHeN2He
Substrate
Column diameter (mm) 0.20.220.250.320.22
Phase thickness (μm) 0.20.250.250.250.25
Tstart (C) 70.60.60.50.60.
Tend (C) 180.220.220.230.220.
Heat rate (K/min) 4.2.2.2.2.
Initial hold (min) 4.  10.
Final hold (min) 15.20.20.15.20.
I 1477.1517.1514.1519.1518.
ReferencePoliteo, Jukic, et al., 2007, 2Boti, Bighelli, et al., 2006Bousmaha, Boti, et al., 2006Dob, Dahmane, et al., 2006Duquesnoy, Dinh, et al., 2006
Comment MSDC-RI MSDC-RI MSDC-RI MSDC-RI MSDC-RI
Column type CapillaryCapillaryCapillaryCapillaryCapillary
Active phase Supelcowax-10Supelcowax-10CP-Wax 52CBBP-20Supelcowax-10
Column length (m) 30.30.60.50.60.
Carrier gas HeHe He
Substrate
Column diameter (mm) 0.20.20.250.220.25
Phase thickness (μm) 0.20.20.250.250.25
Tstart (C) 70.70.35.60.35.
Tend (C) 220.220.203.220.195.
Heat rate (K/min) 3.3.3.2.6.
Initial hold (min)   4. 5.
Final hold (min) 15.15. 20.60.
I 1515.1515.1511.1520.1501.
ReferencePinto, Pina-Vaz, et al., 2006Salgueiro L.R., Pinto E., et al., 2006Alasalvar, Taylor, et al., 2005Boti J.B., Koukoua G., et al., 2005Chung, Fung, et al., 2005
Comment MSDC-RI MSDC-RI MSDC-RI MSDC-RI MSDC-RI
Column type CapillaryCapillaryCapillaryCapillaryCapillary
Active phase RTX-WaxCarbowax 20MSupelcowax-10BP-20ZB-Wax
Column length (m) 60.60.30.50.30.
Carrier gas  HeHe He
Substrate
Column diameter (mm) 0.220.250.20.220.25
Phase thickness (μm) 0.250.250.20.250.15
Tstart (C) 60.45.70.60.35.
Tend (C) 220.250.220.220.220.
Heat rate (K/min) 2.2.3.2.5.
Initial hold (min)  0.17  5.
Final hold (min) 20. 15.20.10.
I 1501.1517.1515.1516.1491.
ReferenceCozzani, Muselli, et al., 2005Verzera, Campisi, et al., 2005Cavaleiro, Salgueiro, et al., 2004Gonny, Bradesi, et al., 2004Ledauphin, Saint-Clair, et al., 2004
Comment MSDC-RI MSDC-RI MSDC-RI MSDC-RI MSDC-RI
Column type CapillaryCapillaryCapillaryCapillaryCapillary
Active phase DB-WaxDB-WaxDB-WaxDB-WaxHP-20M
Column length (m) 30.30.30.30.50.
Carrier gas HeHeHeHeHe
Substrate
Column diameter (mm) 0.250.250.250.250.2
Phase thickness (μm) 0.250.250.250.250.2
Tstart (C) 40.40.40.40.70.
Tend (C) 240.240.200.200.180.
Heat rate (K/min) 6.6.4.4.4.
Initial hold (min) 10.10.5.5.4.
Final hold (min) 25.25.20.20.10.
I 1490.1498.1490.1497.1481.
ReferenceVarming, Andersen, et al., 2004Varming, Petersen, et al., 2004Yu, Kim, et al., 2004Yu, Kim, et al., 2004Bezic, Skocibusic, et al., 2003
Comment MSDC-RI MSDC-RI MSDC-RI MSDC-RI MSDC-RI
Column type CapillaryCapillaryCapillaryCapillaryCapillary
Active phase OV-351RTX-WaxHP-20MHP-InnowaxHP20Wax
Column length (m) 50.60.50.30.50.
Carrier gas HeHeHeHeHe
Substrate
Column diameter (mm) 0.320.220.20.250.2
Phase thickness (μm) 0.20.250.20.50.2
Tstart (C) 60.60.70.60.70.
Tend (C) 220.230.180.260.180.
Heat rate (K/min) 5.2.4.3.4.
Initial hold (min)   4. 4.
Final hold (min)  45.10. 10.
I 1488.1507.1481.1515.1472.
ReferenceBonvehi and Coll, 2003Cavalli, Tomi, et al., 2003Jerkovic, Mastelic, et al., 2003Skaltsa, Demetzos, et al., 2003Skocibusic and Bezic, 2003
Comment MSDC-RI MSDC-RI MSDC-RI MSDC-RI MSDC-RI
Column type CapillaryCapillaryCapillaryCapillaryCapillary
Active phase HP-InnowaxDB-WaxSupelcowax-10RTX-WaxBP-20
Column length (m) 30.60.60.30.50.
Carrier gas HeN2HeHe
Substrate
Column diameter (mm) 0.250.250.250.250.22
Phase thickness (μm) 0.50.250.250.250.25
Tstart (C) 60.70.35.45.60.
Tend (C) 260.230.195.250.220.
Heat rate (K/min) 3.2.2.3.2.
Initial hold (min)   5.6.
Final hold (min)  20.90.10.20.
I 1522.1524.1518.1486.1509.
ReferenceTzakou, Couladis, et al., 2003Choi, Kim. M.-S.L., et al., 2002Chung, Yung, et al., 2002Mondello, Zappia, et al., 2002Pintore, Usai, et al., 2002
Comment MSDC-RI MSDC-RI MSDC-RI MSDC-RI MSDC-RI
Column type CapillaryCapillaryCapillaryCapillaryCapillary
Active phase RTX-WaxRTX-WaxSupelcowax-10HP-InnowaxCP-Wax 52CB
Column length (m) 30.30.60.30.50.
Carrier gas HeHeHeHe
Substrate
Column diameter (mm) 0.250.250.250.250.25
Phase thickness (μm) 0.250.250.250.500.2
Tstart (C) 45.45.35.60.32.
Tend (C) 250.250.195.260.220.
Heat rate (K/min) 3.3.2.3.1.
Initial hold (min) 6.6.5. 1.
Final hold (min)   90.
I 1482.1508.1518.1522.1507.
ReferenceShellie, Mondello, et al., 2002Shellie, Mondello, et al., 2002Chung, Yung, et al., 2001Couladis, Tzakou, et al., 2001Kjeldsen, Christensen, et al., 2001
Comment MSDC-RI MSDC-RI MSDC-RI MSDC-RI MSDC-RI
Column type CapillaryCapillaryCapillaryCapillaryCapillary
Active phase CP-Wax 52CBCP-Wax 52CBCP-Wax 52CBHP-InnowaxSupelcowax-10
Column length (m) 60.25.25.60.60.
Carrier gas He  HeHe
Substrate
Column diameter (mm) 0.250.250.250.250.25
Phase thickness (μm) 0.250.150.15 0.25
Tstart (C) 45.40.40.32.35.
Tend (C) 250.220.220.220.195.
Heat rate (K/min) 2.3.3.2.2.
Initial hold (min) 0.175.5.1.5.
Final hold (min)    40.90.
I 1517.1514.1514.1518.1520.
ReferenceVerzera, Campisi, et al., 2001Chagonda, Makanda, et al., 2000Chagonda, Makanda, et al., 2000Christensen, Jakobsen, et al., 1999Chung, 1999
Comment MSDC-RI MSDC-RI MSDC-RI MSDC-RI MSDC-RI
Column type CapillaryCapillaryCapillaryCapillaryCapillary
Active phase Carbowax 20MDB-WaxDB-WaxDB-WaxCarbowax 20M
Column length (m) 25.60.25.60.60.
Carrier gas H2 HeHeHe
Substrate
Column diameter (mm) 0.250.250.250.320.32
Phase thickness (μm) 0.30.250.250.50.425
Tstart (C) 50.40.50.50.45.
Tend (C) 200.200.240.225.300.
Heat rate (K/min) 3.3.4.2.3.
Initial hold (min) 1.5.3. 3.
Final hold (min) 20.60. 20.20.
I 1514.1519.1496.1528.1508.
ReferenceBicchi, Rubiolo, et al., 1998Cha, Kim, et al., 1998Möllenbeck, König, et al., 1997Sagrero-Nieves, Bartley, et al., 1997Mondello, Dugo, et al., 1995
Comment MSDC-RI MSDC-RI MSDC-RI MSDC-RI MSDC-RI
Column type CapillaryCapillaryCapillaryCapillaryCapillary
Active phase DB-WaxDB-WaxCarbowax 20MPEG-20MPEG-20M
Column length (m) 60.30.60.25.25.
Carrier gas  HeHe
Substrate
Column diameter (mm) 0.250.250.320.260.26
Phase thickness (μm) 0.25  0.30.3
Tstart (C) 50.40.50.100.60.
Tend (C) 230.200.225.200.200.
Heat rate (K/min) 2.2.1.52.2.
Initial hold (min) 4.10.
Final hold (min) 30. 80.
I 1511.1499.1491.1530.41510.1
ReferenceShiratsuchi, Shimoda, et al., 1993Umano, Hagi, et al., 1992Chen and Ho, 1988Wang and Sun, 1987Wang and Sun, 1987
Comment MSDC-RI MSDC-RI MSDC-RI MSDC-RI MSDC-RI
Column type CapillaryCapillaryCapillaryCapillaryCapillary
Active phase PEG-20MPEG-20MPEG-20MPEG-20MPEG-20M
Column length (m) 25.62.62.62.62.
Carrier gas
Substrate
Column diameter (mm) 0.260.270.270.270.27
Phase thickness (μm) 0.3
Tstart (C) 60.100.70.70.80.
Tend (C) 200.
Heat rate (K/min) 8.2.3.4.2.
Initial hold (min)
Final hold (min)
I 1539.51536.61532.71539.51526.3
ReferenceWang and Sun, 1987Wang and Sun, 1985Wang and Sun, 1985Wang and Sun, 1985Wang and Sun, 1985
Comment MSDC-RI MSDC-RI MSDC-RI MSDC-RI MSDC-RI
Column type Capillary
Active phase PEG-20M
Column length (m) 62.
Carrier gas
Substrate
Column diameter (mm) 0.27
Phase thickness (μm)
Tstart (C) 90.
Tend (C)
Heat rate (K/min) 2.
Initial hold (min)
Final hold (min)
I 1531.3
ReferenceWang and Sun, 1985
Comment MSDC-RI

Van Den Dool and Kratz RI, non-polar column, custom temperature program

Data compiled by: NIST Mass Spectrometry Data Center, William E. Wallace, director

Column type CapillaryCapillaryCapillaryCapillaryCapillary
Active phase HP-5MSDB-5BPX-5SE-52SE-52
Column length (m) 30.30.30.30.30.
Carrier gas He  HeHe
Substrate
Column diameter (mm) 0.250.250.250.320.32
Phase thickness (μm) 0.250.250.250.150.15
Program 50C(4min) => 10C/min => 200C(0.5min) => 20C/min => 260C(5min)40C(5min) => 2C/min => 250C(15min) => 10C/min => 270C35C(5min) => 3C/min => 210C => 40C/min => 240C (4min)45C => 1C/min => 100C => 5C/min => 250C (10min)45C => 1C/min => 100C => 5C/min => 250C(10min)
I 1146.1143.1166.1146.1146.
ReferencePérez, Navarro, et al., 2007Basile, Senatore, et al., 2006Cardeal, da Silva, et al., 2006Guerrini, Sacchetti, et al., 2006Sacchetti, Guerrini, et al., 2006
Comment MSDC-RI MSDC-RI MSDC-RI MSDC-RI MSDC-RI
Column type CapillaryCapillaryCapillaryCapillaryCapillary
Active phase HP-5MSSE-52CBP-55 % Phenyl methyl siloxaneSPB-1
Column length (m) 30.30.30.30.50.
Carrier gas HeHeHeHe
Substrate
Column diameter (mm) 0.250.320.250.320.25
Phase thickness (μm) 0.250.150.250.150.25
Program 50C (3min) => 3C/min => 200C => 6C/min => 240C45C => 1C/min => 100C => 5C/min => 250C(10min)60C => 3C/min => 240C => 10C/min => 280C(10min)45C => 1C/min => 100C => 5C/min => 250C (10min)70C(3min) => 4C/min => 120C => 8C/min => 250C
I 1146.1145.1141.1146.1125.
ReferenceAkpulat, Tepe, et al., 2005Bruni, Pellati, et al., 2005Oliveira, Campos, et al., 2005Sacchetti, Maietti, et al., 2005Díaz-Maroto, Sánchez Palomo, et al., 2004
Comment MSDC-RI MSDC-RI MSDC-RI MSDC-RI MSDC-RI
Column type CapillaryCapillaryCapillaryCapillaryCapillary
Active phase SE-52SE-52SPB-1CP Sil 8 CBCBP-5
Column length (m) 25.30.27.50.50.
Carrier gas H2HeHeHeHe
Substrate
Column diameter (mm) 0.320.520.250.320.25
Phase thickness (μm) 0.430.150.25 0.25
Program 60C(8min) => 3C/min => 180C => 20C/min => 250C(10min)45C => 1C/min => 100C => 5C/min => 250C (10min)60C => 3C/min => 180C => 8C/min => 250C (5min)60C (2min) => 5C/min => 160C (1min) => 10C/min => 250C (2min)60C(2min) => 3C/min => 240C => 10C/min => 280C(10min)
I 1140.1146.1124.1143.1140.
ReferenceFrizzo, Lorenzo, et al., 2004Sacchetti, Medici, et al., 2004Sanz, Soria, et al., 2004Mockute and Judzentiene, 2003Azevedo, Campos, et al., 2002
Comment MSDC-RI MSDC-RI MSDC-RI MSDC-RI MSDC-RI
Column type CapillaryCapillaryCapillary
Active phase BP-1BPX-5SE-52
Column length (m)  50.60.
Carrier gas  HeHe
Substrate
Column diameter (mm)  0.320.32
Phase thickness (μm)  0.50.40
Program not specified0C (5min) => 40C/min => 40C (2min) => 10C/min => 280C45 C (6 min) 3 C/min -> 111 0C 2 C/min -> 160 C 3 C/min -> 300 C (15 min)
I 1122.1187.1148.
ReferenceFilippini, Tomi, et al., 2000Elmore, Erbahadir, et al., 1997Mondello, Dugo, et al., 1995
Comment MSDC-RI MSDC-RI MSDC-RI

Normal alkane RI, non-polar column, custom temperature program

Data compiled by: NIST Mass Spectrometry Data Center, William E. Wallace, director

Column type CapillaryCapillaryCapillaryCapillaryCapillary
Active phase DB-1HP-5 MSRTX-1CBP-5HP-5
Column length (m) 30.30.60.30.25.
Carrier gas HydrogenHeliumHeliumHeliumHydrogen
Substrate
Column diameter (mm) 0.250.250.220.250.32
Phase thickness (μm) 0.250.250.250.250.52
Program 45 0C 3 0C/min -> 175 0C 15 0C/min -> 300 0C (10 min)40 0C (5 min) 6 0C -> 120 0C (5 min) 8 0C/min -> 300 0Cnot specified60 0C 3 0C/min -> 240 0C 10 0C/min -> 280 0C (10 min)not specified
I 1102.1149.1119.1146.1146.
ReferenceAlbano, Lima, et al., 2012Attia, Grissa, et al., 2012Bendiabdellah, El Amine Dib, et al., 2012de Morais, Oliveira, et al., 2012Velickovic, Ristic, et al., 2012
Comment MSDC-RI MSDC-RI MSDC-RI MSDC-RI MSDC-RI
Column type CapillaryCapillaryCapillaryCapillaryCapillary
Active phase 5 % Phenyl polydimethyl siloxaneOV-1HP-5 HP-5
Column length (m)  30.  30.
Carrier gas  Helium  Nitrogen
Substrate
Column diameter (mm)  0.25  0.25
Phase thickness (μm)     0.25
Program not specified40 0C 2 0C/min -> 120 0C 10 0C/min -> 230 0C (15 min)not specifiednot specified35 0C (10 min) 3 0C/min -> 205 0C 10 0C/min -> 225 0C
I 1147.1103.1143.1139.1143.
ReferenceChaverri, Diaz, et al., 2011Chen and Li, 2011Citron, Riclea, et al., 2011Karimi, Farmany, et al., 2011Laribi, Kouki, et al., 2011
Comment MSDC-RI MSDC-RI MSDC-RI MSDC-RI MSDC-RI
Column type CapillaryCapillaryCapillaryCapillaryCapillary
Active phase DB-5HP-5 MSHP-5 MSDB-5 MSRTX-1
Column length (m) 60.  60.60.
Carrier gas Helium  HeliumHelium
Substrate
Column diameter (mm) 0.25  0.250.22
Phase thickness (μm) 1.00  0.250.25
Program 40 0C 4 0C/min -> 230 0C 100 0C/min -> 260 0C (11.7 min)not specifiednot specified1 0C 1.5 0C/min -> 128 0C 2.57 0C/min -> 170 0C 4 0C/min -> 300 0C (5 min)not specified
I 1171.1145.1145.1145.1120.
ReferenceMiyazaki, Plotto, et al., 2011Payo, Colo, et al., 2011Payo, Colo, et al., 2011Usano-Alemany, Penalver, et al., 2011Dib, Djabou, et al., 2010
Comment MSDC-RI MSDC-RI MSDC-RI MSDC-RI MSDC-RI
Column type CapillaryCapillaryCapillaryCapillaryCapillary
Active phase HP-5 MSDB-5SLB-5 MSDB-1-MSDB-1
Column length (m) 30.30.10.60.30.
Carrier gas HeliumHeliumHeliumHeliumHelium
Substrate
Column diameter (mm) 0.250.200.100.250.25
Phase thickness (μm) 0.250.320.100.250.25
Program 60 0C (1 min) 10 0C/min -> 180 0C (1 min) 20 0C/min -> 280 0C (15 min)60 0C (1 min) 3 0C/min -> 140 0C 50 0C/min -> 250 0C (3 min)not specifiednot specifiednot specified
I 1143.1146.1149.1118.1139.
ReferenceLiu, Chu, et al., 2010Nezhadali and Parsa, 2010Scandinaro, Tranchida, et al., 2010Takeoka, Hobbs, et al., 2010Xu, Tang, et al., 2010
Comment MSDC-RI MSDC-RI MSDC-RI MSDC-RI MSDC-RI
Column type CapillaryCapillaryCapillaryCapillaryCapillary
Active phase DB-5HP-5 MSDB-5DB-5HP-5
Column length (m) 30.30.30.30.60.
Carrier gas HeliumHeliumHeliumHeliumHelium
Substrate
Column diameter (mm) 0.250.250.250.250.25
Phase thickness (μm) 0.250.250.250.250.25
Program 50 0C m6 0C/min -> 140 0C 5 0C/min -> 160 0C (1 min) 10 0C/min -> 200 0C40 0C (5 min) 2 0C/min -> 270 0C -> 260 0C (20 min)not specifiednot specified30 0C (2 min) 2 0Cmin -> 60 0C 10 0C/min -> 100 0C 20 0C/min -> 140 0C 10 0C/min -> 200 0C (10 min)
I 1156.1145.1139.1152.1156.
ReferenceCourtois, Paine, et al., 2009Mancini, Arnold, et al., 2009Porto, Decorti, et al., 2009Porto, Decorti, et al., 2009Rotsatschakul, Visesanguan, et al., 2009
Comment MSDC-RI MSDC-RI MSDC-RI MSDC-RI MSDC-RI
Column type CapillaryCapillaryCapillaryCapillaryCapillary
Active phase SLB-5 MSSLB-5 MSDB-5CB-1CB-1
Column length (m) 30.30.50.30.30.
Carrier gas HeliumHeliumHeliumHeliumHelium
Substrate
Column diameter (mm) 0.250.250.320.250.25
Phase thickness (μm) 0.250.250.250.250.25
Program 50 0C 3 0C/min -> 250 0C (1 min) 10 0C/min -> 300 0C (5 min)not specified60 0C (2 min) 5 0C/min -> 160 0C (1 min) 10 0C/min -> 250 0C (3 min)40 0C (2 min) 4 0C/min -> 180 0C 20 0C/min -> 220 0C (1 min)not specified
I 1149.1141.1146.1110.1123.
ReferenceCosta, De Fina, et al., 2008Costa, De Fina, et al., 2008Judzentiene and Budiene, 2008Kannaste, Vongvanich, et al., 2008Kannaste, Vongvanich, et al., 2008
Comment MSDC-RI MSDC-RI MSDC-RI MSDC-RI MSDC-RI
Column type CapillaryCapillaryCapillaryCapillaryCapillary
Active phase Elite-1DB-5 MSHP-5MSSPB-1HP-5MS
Column length (m) 30.30.30.50.30.
Carrier gas Helium He He
Substrate
Column diameter (mm) 0.320.250.250.250.25
Phase thickness (μm) 0.250.250.250.250.25
Program not specified80 0C (1.5 min) 4 pC/min -> 180 0C 10 0C/min -> 300 0C (10 min)40C(10min) => 3C/min => 200C => 2C/min => 220C70C(3min) => 4C/min => 120C => 8C/min => 250C(5min)40C(5min) => 2C/min => 250C(15min) => 10C/min => 270C
I 1146.1146.1142.1124.1145.
ReferenceRaj, Baby, et al., 2008Silva, Doria, et al., 2008Cole, Haber, et al., 2007Díaz-Maroto, Castillo, et al., 2007Formisano, Mignola, et al., 2007
Comment MSDC-RI MSDC-RI MSDC-RI MSDC-RI MSDC-RI
Column type CapillaryCapillaryCapillaryCapillaryCapillary
Active phase BP-5DB-1HP-5MSDB-5BPX-5
Column length (m) 30.30.30.50.30.
Carrier gas HeH2HeHeliumHe
Substrate
Column diameter (mm) 0.320.250.250.320.25
Phase thickness (μm) 0.250.250.250.250.25
Program 60C => 4C/min => 150C => 10C/min => 220C45 0C 3 0C/min -> 175 0C 15 0C/min -> 300 0C (10 min)40C(3min) => 8C/min => 160C => 15C/min => 300C (10min)60 0C (1 min) 5 0C/min -> 160 0C 10 0C/min -> 250 0C50C => 3C/min => 150C(10min) => 10C/min => 250C
I 1142.1095.1146.1146.1151.
ReferenceHashemi, Abolghasemi, et al., 2007Kamatou, Viljoen, et al., 2007Liu, Song, et al., 2007Nivinsliene, Butkiene, et al., 2007Ozer H., Sokmen M., et al., 2007
Comment MSDC-RI MSDC-RI MSDC-RI MSDC-RI MSDC-RI
Column type CapillaryCapillaryCapillaryCapillaryCapillary
Active phase DB-5DB-5CP Sil 8 CBDB-1BPX-5
Column length (m) 30.30.50.30.30.
Carrier gas HeHydrogenHeliumHeliumHe
Substrate
Column diameter (mm) 0.250.250.320.250.25
Phase thickness (μm) 0.250.250.250.250.25
Program 50C(1min) => 3C/min => 250C(10min) => 20C/min => 280C (5min)35 0C (2 min) 4 0C/min -> 180 0C 20 0C -> 280 0C60 0C (2 min) 5 0C/min -> 160 0C (1 min) 10 0C/min -> 280 0C (3 min)35 0C 4 0C/min -> 180 0C 10 0C/min -> 250 0C50C => 3C/min => 150C(10min) => 10C/min => 250C
I 1146.1140.1146.1148.1151.
ReferenceParker, Pollnitz, et al., 2007Pontes, de Oliveira, et al., 2007Radusiene, Judzentiene, et al., 2007Rao, Maia, et al., 2007Salamci, Kordali, et al., 2007
Comment MSDC-RI MSDC-RI MSDC-RI MSDC-RI MSDC-RI
Column type CapillaryCapillaryCapillaryCapillaryCapillary
Active phase DB-55 % Phenyl methylsiloxaneHP-5MSHP-5MSBPX-5
Column length (m) 30. 30.30.30.
Carrier gas Hydrogen HeHeHe
Substrate
Column diameter (mm) 0.25 0.250.250.25
Phase thickness (μm) 0.25  0.250.25
Program 35 0C 4 0C/min -> 180 0C 17 0C/min -> 280 0C (10 min)not specified40C(10min) => 3C/min => 200C => 2C/min => 220C40C(3min) => 6C/min => 160C => 10C/min => 300C (10min)50C => 3C/min => 150C(10min) => 10C/min => 250C
I 1146.1163.1144.1144.1152.
ReferenceSantos, Santiago, et al., 2007Serrano, Cornu, et al., 2007Takaku, Haber, et al., 2007Yu, Huang, et al., 2007Baris, Güllüce, et al., 2006
Comment MSDC-RI MSDC-RI MSDC-RI MSDC-RI MSDC-RI
Column type CapillaryCapillaryCapillaryCapillaryCapillary
Active phase SPB-5HP-5MSHP-5MSHP-5SPB-5
Column length (m) 60.30.30.30.60.
Carrier gas HeHeHe He
Substrate
Column diameter (mm) 0.320.250.250.250.32
Phase thickness (μm) 1.0.250.250.251.
Program 60C => 1C/min => 130C => 2C/min => 200C => 4C/min => 250C (40min)50C(2min) => 6C/min => 200C => 10C/min => 270C(10min)40C(5min) => 2C/min => 250C(15min) => 10C/min => 270C>2.5C/min => 180C => 100C/min => 250C (7.3min)60C => 1C/min => 130C => 2C/min => 200C => 4C/min => 250C(40min)
I 1137.1145.1145.1157.1137.
ReferenceChemat, Lucchesi, et al., 2006Deng, Xu, et al., 2006Formisano C., Senatore F., et al., 2006Goodner, Mahattanatawee, et al., 2006Iriti, Colnaghi, et al., 2006
Comment MSDC-RI MSDC-RI MSDC-RI MSDC-RI MSDC-RI
Column type CapillaryCapillaryCapillaryCapillaryCapillary
Active phase CP Sil 8 CBBPX-5DB-5HP-5MSHP-5MS
Column length (m) 50.30.30.30.30.
Carrier gas HeHeHeHeHe
Substrate
Column diameter (mm) 0.320.250.250.250.32
Phase thickness (μm) 0.250.250.250.250.25
Program 60C(2min) => 5C/min => 160C(1min) => 10C/min => 250C (5min)50C => 3C/min => 150C (10min) => 10C/min => 250C35C => 4C/min => 180C => 10C/min => 250C60C => 1.5C/min => 185C(1min) => 9C/min => 275C(2min)60C(1min) => 1.5C => 185C => 9C/min => 275C (2min)
I 1146.1150.1131.1147.1144.
ReferenceJudzentiene and Buzelyte, 2006Ozer H., Kilic H., et al., 2006Santos, Nunes, et al., 2006Singh, Marimuthu, et al., 2006Singh G., Maurya S., et al., 2006
Comment MSDC-RI MSDC-RI MSDC-RI MSDC-RI MSDC-RI
Column type CapillaryCapillaryCapillaryCapillaryCapillary
Active phase SE-52DB-5MSCP Sil 8 CBHP-5MSBP-5
Column length (m) 30.30.50.30.25.
Carrier gas He HeHeHelium
Substrate
Column diameter (mm) 0.320.250.320.250.32
Phase thickness (μm) 0.150.250.250.250.50
Program 45C => 1C/min => 100C => 5C/min => 250C (10min)70C(2min) => 10C/min => 150C(15min) => 5C/min => 240C50C(5min) => 2C/min => 90C => 15C/min => 240C(4min)50C => 8C/min => 200C => 10C/min => 270C (5min)60 0C 6 0C/min -> 210 0C 10 0C/min -> 290 0C (10 min)
I 1146.1143.1143.1146.1164.
ReferenceTognolini, Barocelli, et al., 2006Bagci and Baser, 2005Butkienë, Nivinskienë, et al., 2005Deng, Yao, et al., 2005Eyres, Dufour, et al., 2005
Comment MSDC-RI MSDC-RI MSDC-RI MSDC-RI MSDC-RI
Column type CapillaryCapillaryCapillaryCapillaryCapillary
Active phase BP-5BP-5BP-5BP-5BPX-5
Column length (m) 25.25.25.25.30.
Carrier gas HeliumHeliumHeliumHelium
Substrate
Column diameter (mm) 0.320.320.320.320.25
Phase thickness (μm) 0.500.500.500.500.25
Program not specified60 0C 6 0C/min -> 210 0C 10 0C/min -> 290 0C (10 min)60 0C 6 0C/min -> 210 0C 10 0C/min -> 290 0C (10 min)60 0C 6 0C/min -> 210 0C 10 0C/min -> 290 0C (10 min)60C(0.2min) => 3K/min => 186C => 10C/min => 240C (5min)
I 1146.1156.1161.1166.1143.
ReferenceEyres, Dufour, et al., 2005Eyres, Dufour, et al., 2005Eyres, Dufour, et al., 2005Eyres, Dufour, et al., 2005Judzentiene and Mockute, 2005
Comment MSDC-RI MSDC-RI MSDC-RI MSDC-RI MSDC-RI
Column type CapillaryCapillaryCapillaryCapillaryCapillary
Active phase BPX-5Polydimethyl siloxane with 5 % Ph groupsCP Sil 8 CBHP-5DB-1
Column length (m) 30. 50.30.30.
Carrier gas He He He
Substrate
Column diameter (mm) 0.25 0.320.320.25
Phase thickness (μm) 0.25 0.25 0.25
Program 50C => 3C/min => 150C(10min) => 10C/min => 250Cnot specified60C(2min) => 5C/min => 160C(1min) => 10C/min => 250C (3min)65C(1min) => 1C/min => 75C (2min) => 0.5C/min => 81C(2min) => 3C/min => 180C(7min)45C => 3C/min => 175C => 15C/min => 300C (15min)
I 1152.1143.1146.1144.1095.
ReferenceÖzer, Sahín, et al., 2005Pino, Marbot, et al., 2005Radudienë, Judpintienë, et al., 2005Singh, Maurya, et al., 2005Touafek, Nacer, et al., 2005
Comment MSDC-RI MSDC-RI MSDC-RI MSDC-RI MSDC-RI
Column type CapillaryCapillaryCapillaryCapillaryCapillary
Active phase CP Sil 8 CBMethyl SiliconeHP-5MS OV-1
Column length (m) 50. 30. 30.
Carrier gas He He He
Substrate
Column diameter (mm) 0.32 0.25 0.25
Phase thickness (μm) 0.25 0.25 0.25
Program 50C(5min) => 2C/min => 90C => 15C/min => 240C(4min)not specified60C => 10C/min => 160C => 12C/min => 300C (5min)not specified45 0C (4 min) 3 0C/min -> 75 0C 4 0C/min -> 115 0C 6 0C/min -> 312 0C
I 1143.1148.1146.1124.1111.
ReferenceButkienë, Nivinskienë, et al., 2004Couladis, Özcan, et al., 2004Deng, Li, et al., 2004El-Shazily, Hafez, et al., 2004Hafez and Abdel-Salam, 2004
Comment MSDC-RI MSDC-RI MSDC-RI MSDC-RI MSDC-RI
Column type CapillaryCapillaryCapillaryCapillaryCapillary
Active phase DB-5CP Sil 8 CBDB-5DB-1HP-5MS
Column length (m) 30.50. 30.30.
Carrier gas HeHe HeHe
Substrate
Column diameter (mm) 0.250.32 0.250.25
Phase thickness (μm) 0.25  0.250.25
Program 40C(1min) => 9C/min => 130C => 2C/min => 230C60C(2min) => 5C/min => 160C (1min) => 10C/min => 250C (2min)not specified45C => 3C/min => 175C => 15C/min => 300C (10min)50C(3min) => 3C/min => 150C(10min) => 10C/min => 250C
I 1132.1143.1156.1095.1146.
ReferenceHamm, Bleton, et al., 2004Judpentienë and Mockutë, 2004Lo Cantore, Iacobellis, et al., 2004Miguel, Simões, et al., 2004Sahin, Gulluce, et al., 2004
Comment MSDC-RI MSDC-RI MSDC-RI MSDC-RI MSDC-RI
Column type CapillaryCapillaryCapillaryCapillaryCapillary
Active phase HP-5DB-1HP-5MSHP-5DB-1
Column length (m) 30.30.30.30.30.
Carrier gas  Helium HeHe
Substrate
Column diameter (mm) 0.250.250.250.250.25
Phase thickness (μm) 0.250.250.250.250.25
Program 40C(5min) => 2C/min => 250C(15min) => 10C/min => 270C35 0C 4 0C/min -> 180 0C 10 0C/min -> 250 0C60C(1min) => 1.5C/min => 185C(1min) => 9C/min => 275C(2min)50C (3min) => 3C/min => 150C (10min) => 10C/min => 250C45C => 3C/min => 175C => 15C/min => 300C (15min)
I 1145.1146.1147.1146.1095.
ReferenceSenatore, Apostolides Arnold, et al., 2004Silva, Matos, et al., 2004Singh, Marimuthu, et al., 2004Tepe, Donmez, et al., 2004Touafek, Nacer, et al., 2004
Comment MSDC-RI MSDC-RI MSDC-RI MSDC-RI MSDC-RI
Column type CapillaryCapillaryCapillaryCapillaryCapillary
Active phase SE-30DB-1CP Sil 8 CBCP Sil 8 CBDB-1
Column length (m)  30.50.50.30.
Carrier gas  HeHeHeHe
Substrate
Column diameter (mm)  0.250.320.320.25
Phase thickness (μm)  0.250.250.250.1
Program not specified45C => 3C/min => 175C => 15C/min => 300C (10min)70C(5min) => 3C/min => 100C (1min) => 25C/min => 250C (10min)60C(1min) => 5C/min => 160C => 10C/min => 250C(5min)35C => 4C/min => 180C => 10C/min => 250C
I 1118.1095.1143.1143.1107.
ReferenceVinogradov, 2004Faleiro, Miguel, et al., 2003Mockute and Judzentiene, 2003Mockute, Nivinskiene, et al., 2003Silva, Matos, et al., 2003
Comment MSDC-RI MSDC-RI MSDC-RI MSDC-RI MSDC-RI
Column type CapillaryCapillaryCapillaryCapillaryCapillary
Active phase AT-5SE-30SE-30CP Sil 8 CBCP Sil 8 CB
Column length (m) 60.60.60.50.50.
Carrier gas HeHeHeHeHe
Substrate
Column diameter (mm) 0.250.250.250.320.32
Phase thickness (μm) 0.25
Program 50 0C 5 0C/min -> 135 0C (1 min) 5 0C/min -> 225 0C (5 min) 5 0C/min -> 260 0C50 0C (5 min) 5 0C/min -> 165 0C 4 0C/min -> 230 0Cnot specified60C(2min) => 5C/min => 160C(1min) => 10C/min => 250C (2min)60C(2min) => 5C/min => 160C(1min) => 10C/min => 250C(2min)
I 1143.1140.1136.1143.1143.
ReferenceUsai, Atzei, et al., 2003Li, Wu, et al., 2002Li, Wu, et al., 2002Mockute and Judzentiene, 2002Mockute and Judzentiene, 2002, 2
Comment MSDC-RI MSDC-RI MSDC-RI MSDC-RI MSDC-RI
Column type CapillaryCapillaryCapillaryCapillaryCapillary
Active phase HP-1HP-5MSBP-1DB-1HP-5 MS
Column length (m) 30.30.50.30.30.
Carrier gas HeHeHe Helium
Substrate
Column diameter (mm) 0.320.250.250.250.25
Phase thickness (μm) 0.250.251.0.250.25
Program 40C(3min) => 5C/min => 180C => 15C/min => 240C(15min)40C (10min) => 3C/min => 120C => 10C/min => 250C (5min)-50C => 49.9C/min => 5C(3min) => 3C/min => 50C => 5C/min => 220C(20 min)45 0C 3 K/min -> 175 0C 15 K/min -> 300 0C (10 min)not specified
I 1153.1140.1117.811095.1126.
ReferenceNogueira and Romano, 2002Ansorena, Gimeno, et al., 2001Cooke, Hassoun, et al., 2001Figueiredo, Miguel, et al., 2001Shang, Hu, et al., 2001
Comment MSDC-RI MSDC-RI MSDC-RI MSDC-RI MSDC-RI
Column type CapillaryCapillaryCapillaryCapillaryCapillary
Active phase BP-1SE-30CP Sil 5 CBDB-1OV-1
Column length (m) 50.30.25.30.50.
Carrier gas  HeliumN2HeHe
Substrate
Column diameter (mm) 0.220.250.250.250.32
Phase thickness (μm) 0.250.200.390.250.25
Program not specifiednot specifiednot specified45C => 3C/min => 175C => 15C/min => 240C (10min)1)50C(1min) => 4C/min => 180C => 2C/min => 250C(10min) 2)50C(1min) => 6C/min => 200C => 12C/min => 250C(5min)
I 1124.1126.1126.1095.1129.
ReferenceMuselli, Bighelli, et al., 2000Prikhod'ko, Klyuev, et al., 1999Weyerstahl, Marschall, et al., 1999Baratta, Dorman, et al., 1998Kökdil, 1998
Comment MSDC-RI MSDC-RI MSDC-RI MSDC-RI MSDC-RI
Column type CapillaryCapillaryCapillaryCapillaryCapillary
Active phase HP-1DB-5CP Sil 5 CBCP Sil 5 CBDB-5
Column length (m) 25.30.25.25.15.
Carrier gas  N2HeN2He
Substrate
Column diameter (mm) 0.320.25  0.25
Phase thickness (μm)  0.250.390.390.25
Program not specified45C(5min) => 2C/min => 200C => 5C/min => 250Cnot specifiednot specified40C(5min) => 5C/min => 120C(10min) => 4C/min => 250C(4min) => 5C/min => 280C
I 1120.1149.1125.1124.1147.
ReferenceOng, Acree, et al., 1998Sanda, Koba, et al., 1998Weyerstahl, Marschall, et al., 1998Weyerstahl, Marschall, et al., 1998, 2Anitescu, Doneanu, et al., 1997
Comment MSDC-RI MSDC-RI MSDC-RI MSDC-RI MSDC-RI
Column type CapillaryCapillaryCapillaryCapillaryCapillary
Active phase CP Sil 5 CBPolydimethyl siloxanes5 % Phenyl methyl siloxaneDB-1DB-1
Column length (m) 30.  60.30.
Carrier gas N2   He
Substrate
Column diameter (mm) 0.25  0.320.25
Phase thickness (μm)    0.251.
Program not specifiednot specifiednot specifiednot specified40C (4min) => 10C/min => 200C => 50C/min => 250C
I 1125.1123.1137.1118.1142.
ReferenceWeyerstahl, Marschall, et al., 1997Zenkevich, 1997Sagrero-Nieves and Bartley, 1995Ciccioli, Cecinato, et al., 1994Schuberth, 1994
Comment MSDC-RI MSDC-RI MSDC-RI MSDC-RI MSDC-RI
Column type CapillaryCapillaryCapillaryCapillaryCapillary
Active phase DB-1DB-5DB-5Methyl SiliconeOV-101
Column length (m) 60.30.30.
Carrier gas
Substrate
Column diameter (mm) 0.320.320.32
Phase thickness (μm) 0.251.1.
Program 3 min at 5 C; 5 - 50 C at 3 deg/min; 50 - 220 C at 5 deg/min0C(5min) => 60C/min => 60C (5min) => 4C/min => 250C (5min)0C(5min) => 60C/min => 60C (5min) => 4C/min => 250C (5min)not specifiednot specified
I 1118.1133.1136.1126.1117.
ReferenceCiccioli, Brancaleoni, et al., 1993Storer, Elmore, et al., 1993Storer, Elmore, et al., 1993Grundschober, 1991De Pooter, Vermeesch, et al., 1989
Comment MSDC-RI MSDC-RI MSDC-RI MSDC-RI MSDC-RI
Column type CapillaryCapillaryCapillaryCapillaryCapillary
Active phase OV-101OV-101OV-101OV-1, SE-30, Methyl silicone, SP-2100, OV-101, DB-1, etc.OV-1
Column length (m)   50.50.
Carrier gas   HeHydrogen
Substrate
Column diameter (mm)   0.240.32
Phase thickness (μm)
Program not specifiednot specifiednot specifiednot specifiednot specified
I 1117.1136.1129.1137.1136.
ReferenceDe Pooter, Vermeesch, et al., 1989Shibamoto, 1987Zenkevich and Malamakhov, 1987Waggott and Davies, 1984Ramsey and Flanagan, 1982
Comment MSDC-RI MSDC-RI MSDC-RI MSDC-RI MSDC-RI
Column type OtherPacked
Active phase Methyl SiliconeOV-101
Column length (m)  2.5
Carrier gas  N2
Substrate  Chromosorb G 60-80mesh DMCS
Column diameter (mm)
Phase thickness (μm)
Program not specifiednot specified
I 1137.1126.
ReferenceArdrey and Moffat, 1981Swigar and Silverstein, 1981
Comment MSDC-RI MSDC-RI

References

Steele, 1977
Steele, W.V.,
The standard enthalpies of formation of bicyclic compounds. III. 1,7,7-trimethylbicyclo[2.2.1]heptan-2-one,
J. Chem. Thermodyn., 1977, 9, 311-314. [all data]
Delafontaine, Sabbah, et al., 1973
Delafontaine, J.; Sabbah, R.; Laffitte, M.,
Mesures microcalorimetriques des enthalpies de reference de formation (a l'etat condense) de composes volatils - mise au point de la technique,
Z. Phys. Chem. (Neue Folge), 1973, 84, 157-172. [all data]
Shchukarev and Shchukareva, 1932
Shchukarev, A.N.; Shchukareva, L.A.,
Heat standards,
Russ. J. Phys. Chem. (Engl. Transl.), 1932, 3, 169-174. [all data]
Swietoslawski and Bobinska, 1929
Swietoslawski, M.W.; Bobinska, M.J.,
O cieple spalania kamfory, azobenzenu i hydrazobenzenu - Sur la chaleur de combustion du comphre, de l'hydrazobenzene,
Rocz. Chem., 1929, 9, 723-730. [all data]
Roth and Ostling, 1913
Roth, W.A.; Ostling, G.J.,
Thermochemische Untersuchungen in der alicyclischen Reihe,
Ber., 1913, 46, 309-327. [all data]
Frandsen, 1931
Frandsen, M.,
Cryoscopic constant, heat of fusion, and heat capacity of camphor,
Bur. Stand. J. Res., 1931, 7, 477-483. [all data]
Lecat, 1947
Lecat, M.,
Orthobaric Azeotropes of Sulfides,
Bull. Cl. Sci., Acad. R. Belg., 1947, 33, 160-82. [all data]
Lecat, 1943
Lecat, M.,
Negative and other Azeotropes,
C. R. Hebd. Seances Acad. Sci., 1943, 217, 242. [all data]
Lecat, 1943, 2
Lecat, M.,
Azeotropes of Ethyl Urethane and other Azeotropes,
C. R. Hebd. Seances Acad. Sci., 1943, 217, 273. [all data]
Mjojo, 1979
Mjojo, C.C.,
Order-disorder phenomena: part 2. order-disorder phase equilibria in d-and l-systems of camphor and related compounds.,
J. Chem. Soc., Faraday Trans. 2, 1979, 75, 692-703. [all data]
Frandsen, 1931, 2
Frandsen, M.,
Cryoscopic constant, heat of fusion, and heat capacity of camphor,
Bur. Stand. J. Res., 1931, 1931, 7 477. [all data]
Chickos, Hosseini, et al., 1995
Chickos, James S.; Hosseini, Sarah; Hesse, Donald G.,
Determination of vaporization enthalpies of simple organic molecules by correlations of changes in gas chromatographic net retention times,
Thermochimica Acta, 1995, 249, 41-62, https://doi.org/10.1016/0040-6031(95)90670-3
. [all data]
de Wilde, 1937
de Wilde, J.H.,
«65533»ber die Dampfdrucke des Kampfers,
Z. Anorg. Allg. Chem., 1937, 233, 4, 411-414, https://doi.org/10.1002/zaac.19372330408
. [all data]
Chickos, 1975
Chickos, James Speros,
A simple equilibrium method for determining heats of sublimation,
J. Chem. Educ., 1975, 52, 2, 134-39, https://doi.org/10.1021/ed052p134
. [all data]
Jones, 1960
Jones, A.H.,
Sublimation Pressure Data for Organic Compounds.,
J. Chem. Eng. Data, 1960, 5, 2, 196-200, https://doi.org/10.1021/je60006a019
. [all data]
Sherwood and Bryant, 1957
Sherwood, T.K.; Bryant, J.H., Jr.,
Can. J. Chem. Eng., 1957, 35, 51. [all data]
Wiberg and Cunningham, 1990
Wiberg, K.B.; Cunningham, W.C., Jr.,
Thermochemical studies of carbonyl reactions. 4. Enthalpies of hydrolysis of norbornyl ketals,
J. Org. Chem., 1990, 55, 679-684. [all data]
Hunter and Lias, 1998
Hunter, E.P.; Lias, S.G.,
Evaluated Gas Phase Basicities and Proton Affinities of Molecules: An Update,
J. Phys. Chem. Ref. Data, 1998, 27, 3, 413-656, https://doi.org/10.1063/1.556018
. [all data]
Vilesov, 1960
Vilesov, F.I.,
The photoionization of vapors of compounds whose molecules contain carbonyl groups,
Dokl. Phys. Chem., 1960, 132, 521, In original 1332. [all data]