Diethyl phosphite
- Formula: C4H11O3P
- Molecular weight: 138.1021
- IUPAC Standard InChIKey: MJUJXFBTEFXVKU-UHFFFAOYSA-N
- CAS Registry Number: 762-04-9
- Chemical structure:
View 3d structure (requires JavaScript / HTML 5) - Other names: Phosphonic acid, diethyl ester; Diethyl acid phosphite; Diethyl hydrogen phosphite; Diethyl phosphonate; Hydrogen diethyl phosphite; O,O-Diethyl phosphonate; OPH(OC2H5)2; Diethoxyphosphine oxide; Ethyl phosphonate ((EtO)2HPO); Phosphorous acid, diethyl ester; NSC 2665

Phase change data

Data compiled by: William E. Acree, Jr., James S. Chickos
Quantity | Value | Units | Method | Reference | Comment |
---|---|---|---|---|---|
ΔvapH° | 49.3 | kJ/mol | N/A | Sagadeev and Safina, 2008 |
Enthalpy of vaporization
ΔvapH (kJ/mol) | Temperature (K) | Method | Reference | Comment |
---|---|---|---|---|
38.1 | 353. | A | Stephenson and Malanowski, 1987 | Based on data from 338. to 471. K. |

Gas phase ion energetics data

Data compiled as indicated in comments:
LLK - Sharon G. Lias, Rhoda D. Levin, and Sherif A. Kafafi
Ionization energy determinations
IE (eV) | Method | Reference | Comment |
---|---|---|---|
10.31 | PE | Zverev and Villem, 1980 | LLK |
10.31 | PE | Zverev, Villem, et al., 1979 | LLK |

Van Den Dool and Kratz RI, non-polar column, temperature ramp

Column type | Active phase | I | Reference | Comment |
---|---|---|---|---|
Capillary | SE-54 | 953. | Kostiainen, 2000 | 25. m/0.32 mm/0.25 μm, He, 40. C @ 1. min, 10. K/min, 280. C @ 10. min |

Normal alkane RI, non-polar column, custom temperature program

Column type | Active phase | I | Reference | Comment |
---|---|---|---|---|
Capillary | 5 % Phenyl methyl siloxane | 953. | OPCW, 1997 | Program: not specified |

References

Sagadeev and Safina, 2008
Sagadeev, E.V.; Safina, Yu.G.,
Thermochemistry of dithiophosphoric acid derivatives,
Russ J Gen Chem, 2008, 78, 1, 65-68, https://doi.org/10.1134/S107036320801012X
. [all data]
Stephenson and Malanowski, 1987
Stephenson, Richard M.; Malanowski, Stanislaw,
Handbook of the Thermodynamics of Organic Compounds, 1987, https://doi.org/10.1007/978-94-009-3173-2
. [all data]
Zverev and Villem, 1980
Zverev, V.V.; Villem, Y.Y.,
Ionizationp potentials of phosphoryl compounds,
J. Struct. Chem., 1980, 21, 22, In original 30. [all data]
Zverev, Villem, et al., 1979
Zverev, V.V.; Villem, Ya.Ya.; Bel'skii, V.E.; Kitaev, Yu.P.,
The photoelectronic spectra of phosphoryl compounds,
Izv. Akad. Nauk SSSR, Ser. Khim., 1979, 1, 84. [all data]
Kostiainen, 2000
Kostiainen, O.,
Gas Chromatography in Screening of Chemicals Related to the Chemical Weapons Convention
in Encyclopedia of Analytical Chemistry, Meyers, R.A., ed(s)., John Wiley Sons Ltd, Chichester, 2000, 963-979. [all data]
OPCW, 1997
OPCW,
Conference of the States Parties C-I/DEC.64 (22 May 1997), 1997, retrieved from http://www.opcw.org/html/global/cseries/csp1/CIDEC64.html. [all data]