Perfluoropropane
- Formula: C3F8
- Molecular weight: 188.0193
- IUPAC Standard InChIKey: QYSGYZVSCZSLHT-UHFFFAOYSA-N
- CAS Registry Number: 76-19-7
- Chemical structure:

Gas phase thermochemistry data

Data compiled by: Hussein Y. Afeefy, Joel F. Liebman, and Stephen E. Stein
Quantity | Value | Units | Method | Reference | Comment |
---|---|---|---|---|---|
ΔfH°gas | -1784.7 ± 8.8 | kJ/mol | Ccb | Kolesov, Talakin, et al., 1967 | Reanalyzed by Kolesov and Kozina, 1986, Original value = -1729. kJ/mol |

Reaction thermochemistry data

Data compiled by: Hussein Y. Afeefy, Joel F. Liebman, and Stephen E. Stein
Individual Reactions
By formula: 8Na + C3F8 = 3C + 8FNa
Quantity | Value | Units | Method | Reference | Comment |
---|---|---|---|---|---|
ΔrH° | -2761. ± 7.1 | kJ/mol | Ccb | Kolesov, Talakin, et al., 1967 | gas phase |

Gas phase ion energetics data

Data compiled by: Henry M. Rosenstock, Keith Draxl, Bruce W. Steiner, and John T. Herron
Ionization energy determinations
IE (eV) | Method | Reference |
---|---|---|
13.38 | PE | Dewar and Worley, 1969 |
Appearance energy determinations
Ion | AE (eV) | Other Products | Method | Reference | Comment |
---|---|---|---|---|---|
CF+ | 13.5 | ? | EI | Smith and Kevan, 1967 | |
CF3+ | 13.4 ± 0.1 | ? | EI | Lifshitz and Grajower, 1969 | |
CF3+ | 13.22 | ? | PI | Noutary, 1968 | |
C2F4+ | 13.5 ± 0.1 | ? | EI | Lifshitz and Grajower, 1969 | |
C2F5+ | 13.9 ± 0.1 | CF3 | EI | Lifshitz and Grajower, 1969 | |
C2F5+ | 13.32 | CF3 | PI | Noutary, 1968 | |
C3F7+ | 15.7 ± 0.1 | F | EI | Lifshitz and Grajower, 1969 | |
C3F7+ | 15.44 ± 0.02 | F | PI | Noutary, 1968 | |
F+ | 23.5 | ? | EI | Bibby and Carter, 1963 |

Phase change data

Data compiled as indicated in comments:
BS - Robert L. Brown and Stephen E. Stein
TRC - Thermodynamics Research Center, NIST Boulder Laboratories, Chris Muzny director
DH - Eugene S. Domalski and Elizabeth D. Hearing
AC - William E. Acree, Jr., James S. Chickos
CAL - James S. Chickos, William E. Acree, Jr., Joel F. Liebman, Students of Chem 202 (Introduction to the Literature of Chemistry), University of Missouri -- St. Louis
Quantity | Value | Units | Method | Reference | Comment |
---|---|---|---|---|---|
Tboil | 234. | K | N/A | PCR Inc., 1990 | BS |
Tboil | 237.2 | K | N/A | Weast and Grasselli, 1989 | BS |
Tboil | 235. | K | N/A | Streng, 1971 | Uncertainty assigned by TRC = 2. K; TRC |
Tboil | 236.5 | K | N/A | Gilmour, Zwicker, et al., 1967 | Uncertainty assigned by TRC = 0.5 K; TRC |
Quantity | Value | Units | Method | Reference | Comment |
Tfus | 90. | K | N/A | Streng, 1971 | Uncertainty assigned by TRC = 2. K; TRC |
Quantity | Value | Units | Method | Reference | Comment |
Ttriple | 124.85 | K | N/A | Crowder, Taylor, et al., 1967 | Uncertainty assigned by TRC = 0.3 K; TRC |
Ttriple | 125.45 | K | N/A | Pace and Plaush, 1967 | Crystal phase 1 phase; Uncertainty assigned by TRC = 0.02 K; TRC |
Quantity | Value | Units | Method | Reference | Comment |
Tc | 345.1 | K | N/A | Leu and Robinson, 1992 | Uncertainty assigned by TRC = 0.5 K; TRC |
Tc | 345.03 | K | N/A | Mousa, Kay, et al., 1972 | Uncertainty assigned by TRC = 0.2 K; TRC |
Tc | 345.05 | K | N/A | Brown, 1963 | Uncertainty assigned by TRC = 0.3 K; TRC |
Quantity | Value | Units | Method | Reference | Comment |
Pc | 26.40 | atm | N/A | Leu and Robinson, 1992 | Uncertainty assigned by TRC = 0.099 atm; TRC |
Pc | 61.030 | atm | N/A | Mousa, Kay, et al., 1972 | Uncertainty assigned by TRC = 0.063 atm; TRC |
Pc | 26.4500 | atm | N/A | Brown, 1963 | Uncertainty assigned by TRC = 0.2000 atm; TRC |
Quantity | Value | Units | Method | Reference | Comment |
ρc | 3.21 | mol/l | N/A | Mousa, Kay, et al., 1972 | Uncertainty assigned by TRC = 0.0320 mol/l; TRC |
ρc | 3.34 | mol/l | N/A | Brown, 1963 | Uncertainty assigned by TRC = 0.11 mol/l; TRC |
Enthalpy of vaporization
ΔvapH (kcal/mol) | Temperature (K) | Method | Reference | Comment |
---|---|---|---|---|
4.7230 | 236.42 | N/A | Pace and Plaush, 1967 | P = 101.325 kPa; DH |
5.16 | 222. | A | Stephenson and Malanowski, 1987 | Based on data from 193. to 237. K. See also Pace, 1967.; AC |
5.00 | 244. | N/A | Brown, 1963, 2 | Based on data from 213. to 259. K.; AC |
Entropy of vaporization
ΔvapS (cal/mol*K) | Temperature (K) | Reference | Comment |
---|---|---|---|
19.98 | 236.42 | Pace and Plaush, 1967 | P; DH |
Antoine Equation Parameters
log10(P) = A − (B / (T + C))
P = vapor pressure (atm)
T = temperature (K)
View plot Requires a JavaScript / HTML 5 canvas capable browser.
Temperature (K) | A | B | C | Reference | Comment |
---|---|---|---|---|---|
193.78 to 236.81 | 4.08285 | 842.613 | -30.023 | Pace and Plaush, 1967 | Coefficents calculated by NIST from author's data. |
Enthalpy of fusion
ΔfusH (kcal/mol) | Temperature (K) | Reference | Comment |
---|---|---|---|
0.11 | 125.5 | Domalski and Hearing, 1996 | AC |
Entropy of fusion
ΔfusS (cal/mol*K) | Temperature (K) | Reference | Comment |
---|---|---|---|
8.549 | 99.4 | Domalski and Hearing, 1996 | CAL |
0.911 | 125.5 |
Enthalpy of phase transition
ΔHtrs (kcal/mol) | Temperature (K) | Initial Phase | Final Phase | Reference | Comment |
---|---|---|---|---|---|
0.84981 | 99.39 | crystaline, II | crystaline, I | Pace and Plaush, 1967 | DH |
0.1141 | 125.45 | crystaline, I | liquid | Pace and Plaush, 1967 | DH |
Entropy of phase transition
ΔStrs (cal/mol*K) | Temperature (K) | Initial Phase | Final Phase | Reference | Comment |
---|---|---|---|---|---|
8.549 | 99.39 | crystaline, II | crystaline, I | Pace and Plaush, 1967 | DH |
0.911 | 125.45 | crystaline, I | liquid | Pace and Plaush, 1967 | DH |

Condensed phase thermochemistry data

Data compiled by: Eugene S. Domalski and Elizabeth D. Hearing
Quantity | Value | Units | Method | Reference | Comment |
---|---|---|---|---|---|
S°liquid | 68.650 | cal/mol*K | N/A | Pace and Plaush, 1967 |
Constant pressure heat capacity of liquid
Cp,liquid (cal/mol*K) | Temperature (K) | Reference | Comment |
---|---|---|---|
43.351 | 235. | Pace and Plaush, 1967 | T = 14 to 236 K. |

References

Kolesov, Talakin, et al., 1967
Kolesov, V.P.; Talakin, O.G.; Skuratov, S.M.,
Standard enthalpy of formation of perfluoropropane and enthalpies of formation of normal perfluoroalkanes,
Vestn. Mosk. Univ. Khim., 1967, 22, 38-42. [all data]
Kolesov and Kozina, 1986
Kolesov, V.P.; Kozina, M.P.,
Thermochemistry of organic and organohalogen compounds,
Russ. Chem. Rev., 1986, 55, 912. [all data]
Dewar and Worley, 1969
Dewar, M.J.S.; Worley, S.D.,
Photoelectron spectra of molecules. I. Ionization potentials of some organic molecules and their interpretation,
J. Chem. Phys., 1969, 50, 654. [all data]
Smith and Kevan, 1967
Smith, D.; Kevan, L.,
Dissociative charge exchange of rare-gas ions with C2F6 and C3F8,
J. Chem. Phys., 1967, 46, 1586. [all data]
Lifshitz and Grajower, 1969
Lifshitz, C.; Grajower, R.,
Dissociative electron capture and dissociative ionization in perfluoropropane,
Intern. J. Mass Spectrom. Ion Phys., 1969, 3, 211. [all data]
Noutary, 1968
Noutary, C.J.,
Mass spectrometric study of some fluorocarbons and trifluoromethyl halides,
J.Res. NBS, 1968, 72A, 479. [all data]
Bibby and Carter, 1963
Bibby, M.M.; Carter, G.,
Ionization and dissociation in some fluorocarbon gases,
J. Chem. Soc. Faraday Trans., 1963, 59, 2455. [all data]