Pentafluoroethyl chloride
- Formula: C2ClF5
- Molecular weight: 154.466
- IUPAC Standard InChIKey: RFCAUADVODFSLZ-UHFFFAOYSA-N
- CAS Registry Number: 76-15-3
- Chemical structure:
View 3d structure (requires JavaScript / HTML 5) - Other names: Ethane, chloropentafluoro-; F-115; Fluorocarbon 115; Freon 115; FC 115; Genetron 115; Propellant 115; R 115; 1-Chloro-1,1,2,2,2-pentafluoroethane; CF3CF2Cl; Chloropentafluoroethane; Chloroperfluoroethane; Perfluoroethyl chloride; Pentafluorochloroethane; Monochloropentafluoroethane; 1-Chloropentafluoroethane; CFC 115; Ethane, 1-chloro-1,1,2,2,2-pentafluoro-; FKW 115

Gas phase thermochemistry data

Data compiled by: Hussein Y. Afeefy, Joel F. Liebman, and Stephen E. Stein
Quantity | Value | Units | Method | Reference | Comment |
---|---|---|---|---|---|
ΔfH°gas | -1114. ± 10. | kJ/mol | Eqk | Taccone, Salinovich, et al., 1989 |

Condensed phase thermochemistry data

Data compiled by: Eugene S. Domalski and Elizabeth D. Hearing
Quantity | Value | Units | Method | Reference | Comment |
---|---|---|---|---|---|
S°liquid | 248.03 | J/mol*K | N/A | Aston, Wills, et al., 1955 |
Constant pressure heat capacity of liquid
Cp,liquid (J/mol*K) | Temperature (K) | Reference | Comment |
---|---|---|---|
145.27 | 234.04 | Aston, Wills, et al., 1955 | T = 15 to 234 K. Value is unsmoothed experimental datum. |

Phase change data

Data compiled as indicated in comments:
BS - Robert L. Brown and Stephen E. Stein
TRC - Thermodynamics Research Center, NIST Boulder Laboratories, Chris Muzny director
DH - Eugene S. Domalski and Elizabeth D. Hearing
AC - William E. Acree, Jr., James S. Chickos
CAL - James S. Chickos, William E. Acree, Jr., Joel F. Liebman, Students of Chem 202 (Introduction to the Literature of Chemistry), University of Missouri -- St. Louis
Quantity | Value | Units | Method | Reference | Comment |
---|---|---|---|---|---|
Tboil | 235. to 236. | K | N/A | PCR Inc., 1990 | BS |
Tboil | 235.2 | K | N/A | Weast and Grasselli, 1989 | BS |
Tboil | 235. | K | N/A | Cuculo and Bigelow, 1952 | Uncertainty assigned by TRC = 3. K; TRC |
Tboil | 263. | K | N/A | Park, Benning, et al., 1947 | Uncertainty assigned by TRC = 3. K; TRC |
Quantity | Value | Units | Method | Reference | Comment |
Ttriple | 173.71 | K | N/A | Aston, Wills, et al., 1955, 2 | Crystal phase 1 phase; Uncertainty assigned by TRC = 0.05 K; based on To = 273.16 K; TRC |
Quantity | Value | Units | Method | Reference | Comment |
Tc | 352.94 | K | N/A | Yada, Uematsu, et al., 1989 | Uncertainty assigned by TRC = 0.05 K; TRC |
Tc | 353.1 | K | N/A | Mears, Rosenthal. E., et al., 1966 | Uncertainty assigned by TRC = 0.15 K; TRC |
Quantity | Value | Units | Method | Reference | Comment |
Pc | 31.20 | bar | N/A | Yada, Uematsu, et al., 1989 | Uncertainty assigned by TRC = 0.08 bar; TRC |
Pc | 31.5729 | bar | N/A | Mears, Rosenthal. E., et al., 1966 | Uncertainty assigned by TRC = 0.0709 bar; TRC |
Quantity | Value | Units | Method | Reference | Comment |
ρc | 3.91 | mol/l | N/A | Yada, Uematsu, et al., 1989 | Uncertainty assigned by TRC = 0.03 mol/l; TRC |
ρc | 3.969 | mol/l | N/A | Mears, Rosenthal. E., et al., 1966 | Uncertainty assigned by TRC = 0.0097 mol/l; TRC |
Enthalpy of vaporization
ΔvapH (kJ/mol) | Temperature (K) | Method | Reference | Comment |
---|---|---|---|---|
19.410 | 234.04 | N/A | Aston, Wills, et al., 1955 | P = 101.325 kPa; DH |
19.7 | 277. | A | Stephenson and Malanowski, 1987 | Based on data from 262. to 317. K.; AC |
20.1 | 250. | A | Stephenson and Malanowski, 1987 | Based on data from 234. to 265. K.; AC |
19.7 | 327. | A | Stephenson and Malanowski, 1987 | Based on data from 312. to 353. K.; AC |
20.9 | 220. | A | Stephenson and Malanowski, 1987 | Based on data from 176. to 235. K. See also Aston, Wills, et al., 1955.; AC |
20.9 | 219. | N/A | Mears, Rosenthal, et al., 1966 | Based on data from 178. to 234. K.; AC |
19.4 ± 0.1 | 234. | C | Aston, Wills, et al., 1955 | AC |
Entropy of vaporization
ΔvapS (J/mol*K) | Temperature (K) | Reference | Comment |
---|---|---|---|
82.93 | 234.04 | Aston, Wills, et al., 1955 | P; DH |
Enthalpy of fusion
ΔfusH (kJ/mol) | Temperature (K) | Reference | Comment |
---|---|---|---|
1.88 | 173.7 | Domalski and Hearing, 1996 | AC |
Entropy of fusion
ΔfusS (J/mol*K) | Temperature (K) | Reference | Comment |
---|---|---|---|
32.76 | 80.24 | Domalski and Hearing, 1996 | CAL |
10.79 | 173.7 |
Enthalpy of phase transition
ΔHtrs (kJ/mol) | Temperature (K) | Initial Phase | Final Phase | Reference | Comment |
---|---|---|---|---|---|
2.628 | 80.24 | crystaline, II | crystaline, I | Aston, Wills, et al., 1955 | DH |
1.879 | 173.71 | crystaline, I | liquid | Aston, Wills, et al., 1955 | DH |
Entropy of phase transition
ΔStrs (J/mol*K) | Temperature (K) | Initial Phase | Final Phase | Reference | Comment |
---|---|---|---|---|---|
32.75 | 80.24 | crystaline, II | crystaline, I | Aston, Wills, et al., 1955 | DH |
10.82 | 173.71 | crystaline, I | liquid | Aston, Wills, et al., 1955 | DH |

Reaction thermochemistry data

Data compiled by: Hussein Y. Afeefy, Joel F. Liebman, and Stephen E. Stein
Individual Reactions
+
= C2BrF5 +
By formula: BrCl + C2ClF5 = C2BrF5 + Cl2
Quantity | Value | Units | Method | Reference | Comment |
---|---|---|---|---|---|
ΔrH° | 43. ± 3. | kJ/mol | Eqk | Coomber and Whittle, 1967 | gas phase |

Henry's Law data

Data compiled by: Rolf Sander
Henry's Law constant (water solution)
kH(T) = k°H exp(d(ln(kH))/d(1/T) ((1/T) - 1/(298.15 K)))
k°H = Henry's law constant for solubility in water at 298.15 K (mol/(kg*bar))
d(ln(kH))/d(1/T) = Temperature dependence constant (K)
k°H (mol/(kg*bar)) | d(ln(kH))/d(1/T) (K) | Method | Reference | Comment |
---|---|---|---|---|
0.00038 | Q | N/A | missing citation give several references for the Henry's law constants but don't assign them to specific species. | |
0.00034 | 2800. | L | N/A | |
0.00032 | V | N/A |

Gas phase ion energetics data

Data compiled by: Sharon G. Lias, Rhoda D. Levin, and Sherif A. Kafafi
Ionization energy determinations
IE (eV) | Method | Reference | Comment |
---|---|---|---|
12.6 | PE | Doucet, Sauvageau, et al., 1975 | |
12.96 | PE | Doucet, Sauvageau, et al., 1975 | Vertical value |

Normal alkane RI, non-polar column, custom temperature program

Column type | Active phase | I | Reference | Comment |
---|---|---|---|---|
Capillary | Porapack Q | 270. | Zenkevich and Rodin, 2004 | Program: not specified |

References

Taccone, Salinovich, et al., 1989
Taccone, R.A.; Salinovich, O.; Staricco, E.H.,
Kinetic and thermochemical parameters of chlorine atom transfer reactions from CF3Cl, CF3CF2Cl, CF2ClCF2Cl, and CF2ClFCl2 in gas phase,
Int. J. Chem. Kinet., 1989, 21, 331-341. [all data]
Aston, Wills, et al., 1955
Aston, J.G.; Wills, P.E.; Zolki, T.P.,
The heat capacities from 10.9°K., heats of transition, fusion and vaporization, vapor pressures and entropy of pentafluorochloroethane, the barrier hindering internal rotation,
J. Am. Chem. Soc., 1955, 77, 3939-3941. [all data]
PCR Inc., 1990
PCR Inc.,
Research Chemicals Catalog 1990-1991, PCR Inc., Gainesville, FL, 1990, 1. [all data]
Weast and Grasselli, 1989
CRC Handbook of Data on Organic Compounds, 2nd Editon, Weast,R.C and Grasselli, J.G., ed(s)., CRC Press, Inc., Boca Raton, FL, 1989, 1. [all data]
Cuculo and Bigelow, 1952
Cuculo, J.A.; Bigelow, L.A.,
The Action of elementary Fluorine upon Organic Compounds. XVII. The Direct Fluorination of Acetonitrile,
J. Am. Chem. Soc., 1952, 74, 710. [all data]
Park, Benning, et al., 1947
Park, J.D.; Benning, A.F.; Downing, F.B.; Laucius, J.F.; McHarness, R.C.,
Synthesis of Tetrafluoroethylene. Pyrolysis of Monochlorodifluoromethane,
Ind. Eng. Chem., 1947, 39, 343-8. [all data]
Aston, Wills, et al., 1955, 2
Aston, J.G.; Wills, P.E.; Zolki, T.P.,
The Heat Capacities from 10.9 K, Heats of Transition, Fusion and Vaporization, Vapor PRessures and Entropy of Pentafluorochlorethane, the Barrier Hindering Internal Rotation,
J. Am. Chem. Soc., 1955, 77, 3939. [all data]
Yada, Uematsu, et al., 1989
Yada, N.; Uematsu, M.; Watanabe, K.,
Measurements of the vapor pressure and PVT properties for refrigerant 115,
Nippon Kikai Gakkai Ronbunshu, B-hen, 1989, 55, 2426. [all data]
Mears, Rosenthal. E., et al., 1966
Mears, W.H.; Rosenthal. E.; Sinka, J.V.,
Pressure-Volume-Temperature Behavior of Pentafluoromonochlorethane,
J. Chem. Eng. Data, 1966, 11, 338. [all data]
Stephenson and Malanowski, 1987
Stephenson, Richard M.; Malanowski, Stanislaw,
Handbook of the Thermodynamics of Organic Compounds, 1987, https://doi.org/10.1007/978-94-009-3173-2
. [all data]
Mears, Rosenthal, et al., 1966
Mears, W.H.; Rosenthal, Eli; Sinka, J.V.,
Pressure - Volume - Temperature Behavior of Pentafluoromonochloroethane.,
J. Chem. Eng. Data, 1966, 11, 3, 338-343, https://doi.org/10.1021/je60030a014
. [all data]
Domalski and Hearing, 1996
Domalski, Eugene S.; Hearing, Elizabeth D.,
Heat Capacities and Entropies of Organic Compounds in the Condensed Phase. Volume III,
J. Phys. Chem. Ref. Data, 1996, 25, 1, 1, https://doi.org/10.1063/1.555985
. [all data]
Coomber and Whittle, 1967
Coomber, J.W.; Whittle, E.,
Bond dissociation energies from equilibrium studies. Part 3.-D(CF3-Cl), D(C2F5-Cl) and the enthalpy of formation of CF3Cl,
Trans. Faraday Soc., 1967, 63, 2656-2667. [all data]
Doucet, Sauvageau, et al., 1975
Doucet, J.; Sauvageau, P.; Sandorfy, C.,
Photoelectron far-ultraviolet absorption spectra of chlorofluoro derivatives of ethane,
J. Chem. Phys., 1975, 62, 355. [all data]
Zenkevich and Rodin, 2004
Zenkevich, I.G.; Rodin, A.A.,
Gas chromatographic identification of some volatile toxic fluorine containing compounds by precalculated retention indices,
J. Ecol. Chem. (Rus.), 2004, 13, 1, 22-28. [all data]