2,3-Butanediol, 2,3-dimethyl-
- Formula: C6H14O2
- Molecular weight: 118.1742
- IUPAC Standard InChIKey: IVDFJHOHABJVEH-UHFFFAOYSA-N
- CAS Registry Number: 76-09-5
- Chemical structure:
View 3d structure (requires JavaScript / HTML 5) - Other names: Pinacol; Tetramethylethylene glycol; 2,3-Dimethyl-2,3-butanediol; meso-2,3-Dimethyl-2,3-butanediol; 2,3-Dihydroxy-2,3-dimethylbutane; 2,3-Dimethyl-2,3-dihydroxybutane

Gas phase thermochemistry data

Data compiled by: Hussein Y. Afeefy, Joel F. Liebman, and Stephen E. Stein
Quantity | Value | Units | Method | Reference | Comment |
---|---|---|---|---|---|
ΔfH°gas | -540.4 ± 9.4 | kJ/mol | Cm | Guthrie, 1977 | Hydrolysis |

Condensed phase thermochemistry data

Data compiled by: Hussein Y. Afeefy, Joel F. Liebman, and Stephen E. Stein
Quantity | Value | Units | Method | Reference | Comment |
---|---|---|---|---|---|
ΔfH°liquid | -606.3 ± 8.4 | kJ/mol | Cm | Guthrie, 1977 | Hydrolysis |

Phase change data

Data compiled as indicated in comments:
BS - Robert L. Brown and Stephen E. Stein
TRC - Thermodynamics Research Center, NIST Boulder Laboratories, Chris Muzny director
ALS - Hussein Y. Afeefy, Joel F. Liebman, and Stephen E. Stein
DRB - Donald R. Burgess, Jr.
AC - William E. Acree, Jr., James S. Chickos
Quantity | Value | Units | Method | Reference | Comment |
---|---|---|---|---|---|
Tboil | 449. ± 20. | K | AVG | N/A | Average of 9 values; Individual data points |
Quantity | Value | Units | Method | Reference | Comment |
Tfus | 316.48 | K | N/A | Priest, Woolley, et al., 1983 | Uncertainty assigned by TRC = 0.05 K; TRC |
Tfus | 314.25 | K | N/A | Mellan, 1962 | Uncertainty assigned by TRC = 1. K; TRC |
Quantity | Value | Units | Method | Reference | Comment |
ΔvapH° | 65.9 ± 4.2 | kJ/mol | E | Guthrie, 1977 | Hydrolysis; ALS |
ΔvapH° | 65.9 | kJ/mol | N/A | Guthrie, 1977 | DRB |
Reduced pressure boiling point
Tboil (K) | Pressure (bar) | Reference | Comment |
---|---|---|---|
444.7 | 0.985 | Aldrich Chemical Company Inc., 1990 | BS |
Enthalpy of vaporization
ΔvapH (kJ/mol) | Temperature (K) | Method | Reference | Comment |
---|---|---|---|---|
59.1 | 361. | A | Stephenson and Malanowski, 1987 | Based on data from 346. to 448. K.; AC |
Enthalpy of fusion
ΔfusH (kJ/mol) | Temperature (K) | Method | Reference | Comment |
---|---|---|---|---|
14.7 | 316.2 | DSC | Priest, Woolley, et al., 1983, 2 | AC |

Gas phase ion energetics data

Data compiled by: Sharon G. Lias and Joel F. Liebman
Appearance energy determinations
Ion | AE (eV) | Other Products | Method | Reference | Comment |
---|---|---|---|---|---|
C3H7O+ | 9.60 | C3H7O | EI | Holmes, Lossing, et al., 1991 |

Kovats' RI, non-polar column, isothermal

Column type | Active phase | Temperature (C) | I | Reference | Comment |
---|---|---|---|---|---|
Packed | Apiezon L | 160. | 850. | Bogoslovsky, Anvaer, et al., 1978 | Celite 545 |

Van Den Dool and Kratz RI, polar column, temperature ramp

Column type | Active phase | I | Reference | Comment |
---|---|---|---|---|
Capillary | DB-Wax | 1338. | Shiratsuchi, Shimoda, et al., 1994 | 60. m/0.25 mm/0.25 μm, 2. K/min, 230. C @ 60. min; Tstart: 50. C |
Capillary | DB-Wax | 1338. | Shiratsuchi, Shimoda, et al., 1994, 2 | 60. m/0.25 mm/0.25 μm, He, 2. K/min, 230. C @ 60. min; Tstart: 50. C |

Normal alkane RI, non-polar column, custom temperature program

Column type | Active phase | I | Reference | Comment |
---|---|---|---|---|
Capillary | SE-30 | 843. | Vinogradov, 2004 | Program: not specified |

References

Guthrie, 1977
Guthrie, J.P.,
Cyclization of glycol monoesters to give hemiorthoesters: a test of the thermochemical method for determining free energies of tetrahedral intermediates,
Can. J. Chem., 1977, 55, 3562-3574. [all data]
Priest, Woolley, et al., 1983
Priest, J.G.; Woolley, E.M.; Ott, J.B.; Goates, J.R.,
Solid+liquid phase equilibria, excess enthalpies, and enthalpies of fusion fusion in 2,3-dimethyl-2,3-butanediol + water.,
J. Chem. Thermodyn., 1983, 15, 357-66. [all data]
Mellan, 1962
Mellan, I.,
Polyhydric Alcohols, Spartan Books: Washington, DC, 1962. [all data]
Aldrich Chemical Company Inc., 1990
Aldrich Chemical Company Inc.,
Catalog Handbook of Fine Chemicals, Aldrich Chemical Company, Inc., Milwaukee WI, 1990, 1. [all data]
Stephenson and Malanowski, 1987
Stephenson, Richard M.; Malanowski, Stanislaw,
Handbook of the Thermodynamics of Organic Compounds, 1987, https://doi.org/10.1007/978-94-009-3173-2
. [all data]
Priest, Woolley, et al., 1983, 2
Priest, Jeffrey G.; Woolley, Earl M.; Ott, J. Bevan; Goates, J. Rex,
Solid + liquid phase equilibria, excess enthalpies, and enthalpies of fusion in (2,3-dimethyl-2,3-butanediol + water),
The Journal of Chemical Thermodynamics, 1983, 15, 4, 357-366, https://doi.org/10.1016/0021-9614(83)90065-4
. [all data]
Holmes, Lossing, et al., 1991
Holmes, J.L.; Lossing, F.P.; Mayer, P.M.,
Heats of formation of oxygen-containing organic free radicals from appearance energy measurements,
J. Am. Chem. Soc., 1991, 113, 9723. [all data]
Bogoslovsky, Anvaer, et al., 1978
Bogoslovsky, Yu.N.; Anvaer, B.I.; Vigdergauz, M.S.,
Chromatographic constants in gas chromatography (in Russian), Standards Publ. House, Moscow, 1978, 192. [all data]
Shiratsuchi, Shimoda, et al., 1994
Shiratsuchi, H.; Shimoda, M.; Imayoshi, K.; Noda, K.; Osajima, Y.,
Off-flavor compounds in spray-dried skim milk powder,
J. Agric. Food Chem., 1994, 42, 6, 1323-1327, https://doi.org/10.1021/jf00042a014
. [all data]
Shiratsuchi, Shimoda, et al., 1994, 2
Shiratsuchi, H.; Shimoda, M.; Imayoshi, K.; Noda, K.; Osajima, Y.,
Volatile flavor compounds in spray-dried skim milk powder,
J. Agric. Food Chem., 1994, 42, 4, 984-988, https://doi.org/10.1021/jf00040a028
. [all data]
Vinogradov, 2004
Vinogradov, B.A.,
Production, composition, properties and application of essential oils, 2004, retrieved from http://viness.narod.ru. [all data]