Trifluoroacetic acid
- Formula: C2HF3O2
- Molecular weight: 114.0233
- IUPAC Standard InChIKey: DTQVDTLACAAQTR-UHFFFAOYSA-N
- CAS Registry Number: 76-05-1
- Chemical structure:
View 3d structure (requires JavaScript / HTML 5) - Other names: Acetic acid, trifluoro-; Perfluoroacetic acid; Trifluoroethanoic acid; CF3COOH; Kyselina trifluoroctova; Trifluoracetic acid; UN 2699; Acetic acid, 2,2,2-trifluoro-; NSC 77366

Gas phase thermochemistry data

Data compiled by: Hussein Y. Afeefy, Joel F. Liebman, and Stephen E. Stein
Quantity | Value | Units | Method | Reference | Comment |
---|---|---|---|---|---|
ΔfH°gas | -1018. ± 4.6 | kJ/mol | Eqk | Guthrie, 1976 | |
ΔfH°gas | -1031.4 ± 1.7 | kJ/mol | Ccr | Kolesov, Slavutskaya, et al., 1972 | Reanalyzed by Pedley, Naylor, et al., 1986, Original value = -1022. ± 2. kJ/mol; see Kolesov and Zenkov, 1966 |

Condensed phase thermochemistry data

Data compiled by: Hussein Y. Afeefy, Joel F. Liebman, and Stephen E. Stein
Quantity | Value | Units | Method | Reference | Comment |
---|---|---|---|---|---|
ΔfH°liquid | -1069.9 ± 1.5 | kJ/mol | Ccr | Kolesov, Slavutskaya, et al., 1972 | Reanalyzed by Pedley, Naylor, et al., 1986, Original value = -1060. ± 2. kJ/mol; see Kolesov and Zenkov, 1966 |
Quantity | Value | Units | Method | Reference | Comment |
ΔcH°liquid | -397.2 ± 1.5 | kJ/mol | Ccr | Kolesov, Slavutskaya, et al., 1972 | see Kolesov and Zenkov, 1966 |

Phase change data

Data compiled as indicated in comments:
BS - Robert L. Brown and Stephen E. Stein
TRC - Thermodynamics Research Center, NIST Boulder Laboratories, Chris Muzny director
ALS - Hussein Y. Afeefy, Joel F. Liebman, and Stephen E. Stein
AC - William E. Acree, Jr., James S. Chickos
Quantity | Value | Units | Method | Reference | Comment |
---|---|---|---|---|---|
Tboil | 347. | K | N/A | Farchan Laboratories, 1990 | BS |
Tboil | 347. | K | N/A | PCR Inc., 1990 | BS |
Tboil | 345.6 | K | N/A | Weast and Grasselli, 1989 | BS |
Tboil | 345.1 | K | N/A | Malijevska, Sysova, et al., 1986 | Uncertainty assigned by TRC = 0.2 K; TRC |
Tboil | 345.7 | K | N/A | Parnes, Khotimskaya, et al., 1969 | Uncertainty assigned by TRC = 1. K; TRC |
Quantity | Value | Units | Method | Reference | Comment |
Tfus | 531.17 | K | N/A | Kohler, Atrops, et al., 1981 | Uncertainty assigned by TRC = 0.2 K; TRC |
Tfus | 288.43 | K | N/A | Parnes, Khotimskaya, et al., 1969 | Uncertainty assigned by TRC = 0.2 K; TRC |
Quantity | Value | Units | Method | Reference | Comment |
ΔvapH° | 41. ± 3. | kJ/mol | E | Guthrie, 1976 | ALS |
Enthalpy of vaporization
ΔvapH (kJ/mol) | Temperature (K) | Method | Reference | Comment |
---|---|---|---|---|
35.9 | 300. | A | Stephenson and Malanowski, 1987 | Based on data from 285. to 345. K. See also Kreglewski, 1962, Dykyj, 1970, and Boublik, Fried, et al., 1984.; AC |
Antoine Equation Parameters
log10(P) = A − (B / (T + C))
P = vapor pressure (bar)
T = temperature (K)
View plot Requires a JavaScript / HTML 5 canvas capable browser.
Temperature (K) | A | B | C | Reference | Comment |
---|---|---|---|---|---|
285. to 344.80 | 3.34534 | 1267.252 | -52.958 | Kreglewski, 1962, 2 | Coefficents calculated by NIST from author's data. |

Reaction thermochemistry data

Data compiled as indicated in comments:
M - Michael M. Meot-Ner (Mautner) and Sharon G. Lias
B - John E. Bartmess
ALS - Hussein Y. Afeefy, Joel F. Liebman, and Stephen E. Stein
MS - José A. Martinho Simões
Individual Reactions
By formula: C2H2F3O2+ + C2HF3O2 = (C2H2F3O2+ • C2HF3O2)
Bond type: Hydrogen bonds of the type OH-O between organics
Quantity | Value | Units | Method | Reference | Comment |
---|---|---|---|---|---|
ΔrH° | 123. | kJ/mol | ICR | Larson and McMahon, 1982 | gas phase; switching reaction(H3O+)H2O, Entropy change calculated or estimated; Cunningham, Payzant, et al., 1972, Lias, Liebman, et al., 1984, Keesee and Castleman, 1986; M |
Quantity | Value | Units | Method | Reference | Comment |
ΔrS° | 119. | J/mol*K | N/A | Larson and McMahon, 1982 | gas phase; switching reaction(H3O+)H2O, Entropy change calculated or estimated; Cunningham, Payzant, et al., 1972, Lias, Liebman, et al., 1984, Keesee and Castleman, 1986; M |
Quantity | Value | Units | Method | Reference | Comment |
ΔrG° | 87.0 | kJ/mol | ICR | Larson and McMahon, 1982 | gas phase; switching reaction(H3O+)H2O, Entropy change calculated or estimated; Cunningham, Payzant, et al., 1972, Lias, Liebman, et al., 1984, Keesee and Castleman, 1986; M |
By formula: C2F3O2- + H+ = C2HF3O2
Quantity | Value | Units | Method | Reference | Comment |
---|---|---|---|---|---|
ΔrH° | 1355. ± 12. | kJ/mol | G+TS | Caldwell, Renneboog, et al., 1989 | gas phase; B |
ΔrH° | 1351. ± 12. | kJ/mol | G+TS | Jinfeng, Topsom, et al., 1988 | gas phase; value altered from reference due to change in acidity scale; B |
ΔrH° | 1351. ± 17. | kJ/mol | G+TS | Cumming and Kebarle, 1978 | gas phase; B |
Quantity | Value | Units | Method | Reference | Comment |
ΔrG° | 1328. ± 8.4 | kJ/mol | IMRE | Caldwell, Renneboog, et al., 1989 | gas phase; B |
ΔrG° | 1324. ± 8.4 | kJ/mol | IMRE | Jinfeng, Topsom, et al., 1988 | gas phase; value altered from reference due to change in acidity scale; B |
ΔrG° | 1323. ± 8.4 | kJ/mol | IMRE | Cumming and Kebarle, 1978 | gas phase; B |
By formula: C4F6O3 + C5H10O = C7H9F3O2 + C2HF3O2
Quantity | Value | Units | Method | Reference | Comment |
---|---|---|---|---|---|
ΔrH° | -92.96 ± 0.23 | kJ/mol | Cac | Wiberg, Wasserman, et al., 1985 | liquid phase; solvent: Trifluoroactic acid; Trifluoroacetolysis; ALS |
By formula: C7H10 + C2HF3O2 = C9H11F3O2
Quantity | Value | Units | Method | Reference | Comment |
---|---|---|---|---|---|
ΔrH° | -64.15 ± 0.23 | kJ/mol | Cac | Wiberg, Wasserman, et al., 1985 | liquid phase; solvent: Trifluoroacetic acid; Trifluoroacetolysis; ALS |
By formula: C7H12 + C2HF3O2 = C9H13F3O3
Quantity | Value | Units | Method | Reference | Comment |
---|---|---|---|---|---|
ΔrH° | -44.81 ± 0.10 | kJ/mol | Cac | Wiberg, Wasserman, et al., 1985 | liquid phase; solvent: Trifluoroacetic acid; Trifluoroacetolysis; ALS |
By formula: C6H10 + C2HF3O2 = C8H11F3O2
Quantity | Value | Units | Method | Reference | Comment |
---|---|---|---|---|---|
ΔrH° | -43.3 ± 0.1 | kJ/mol | Cac | Wiberg, Wasserman, et al., 1985 | liquid phase; solvent: Trifluoroacetic acid; Triflouroacetolysis; ALS |
By formula: C5H8 + C2HF3O2 = C7H9F3O2
Quantity | Value | Units | Method | Reference | Comment |
---|---|---|---|---|---|
ΔrH° | -38.35 ± 0.18 | kJ/mol | Cac | Wiberg, Wasserman, et al., 1985 | liquid phase; solvent: Trifluoroacetic acid; Trifluoroacetolysis; ALS |
By formula: C7H12 + C2HF3O2 = C9H13F3O3
Quantity | Value | Units | Method | Reference | Comment |
---|---|---|---|---|---|
ΔrH° | -36.56 ± 0.88 | kJ/mol | Cac | Wiberg, Wasserman, et al., 1985 | liquid phase; solvent: Trifluoroacetic acid; Trifluoroacetolysis; ALS |
C14H10F6MoO4 (cr) + 2( • 4.40
) (solution) = C10H10Cl2Mo (cr) + 2
(l)
By formula: C14H10F6MoO4 (cr) + 2(HCl • 4.40H2O) (solution) = C10H10Cl2Mo (cr) + 2C2HF3O2 (l)
Quantity | Value | Units | Method | Reference | Comment |
---|---|---|---|---|---|
ΔrH° | 58.2 ± 2.5 | kJ/mol | RSC | Calado, Dias, et al., 1981 | Please also see Calhorda, Carrondo, et al., 1986.; MS |
C14H10F6O4Ti (cr) + 2( • 4.40
) (solution) =
(cr) + 2
(l)
By formula: C14H10F6O4Ti (cr) + 2(HCl • 4.40H2O) (solution) = C10H10Cl2Ti (cr) + 2C2HF3O2 (l)
Quantity | Value | Units | Method | Reference | Comment |
---|---|---|---|---|---|
ΔrH° | 37.8 ± 2.3 | kJ/mol | RSC | Calado, Dias, et al., 1981 | Please also see Calhorda, Carrondo, et al., 1986.; MS |
C14H10F6O4W (cr) + 2( • 4.40
) (solution) = C10H10Cl2W (cr) + 2
(l)
By formula: C14H10F6O4W (cr) + 2(HCl • 4.40H2O) (solution) = C10H10Cl2W (cr) + 2C2HF3O2 (l)
Quantity | Value | Units | Method | Reference | Comment |
---|---|---|---|---|---|
ΔrH° | 31.9 ± 1.9 | kJ/mol | RSC | Calado, Dias, et al., 1981 | Please also see Calhorda, Carrondo, et al., 1986.; MS |
By formula: C4F6O3 + C7H12O = C9H11F3O2 + C2HF3O2
Quantity | Value | Units | Method | Reference | Comment |
---|---|---|---|---|---|
ΔrH° | -91.09 ± 0.14 | kJ/mol | Cac | Wiberg, Wasserman, et al., 1985 | liquid phase; Trifluoroacetolysis; ALS |
By formula: C6H12O + C4F6O3 = C8H11F3O2 + C2HF3O2
Quantity | Value | Units | Method | Reference | Comment |
---|---|---|---|---|---|
ΔrH° | -90.06 ± 0.15 | kJ/mol | Cac | Wiberg, Wasserman, et al., 1985 | liquid phase; Trifluoroacetolysis; ALS |
By formula: C4F6O3 + C5H12O = C7H11F3O2 + C2HF3O2
Quantity | Value | Units | Method | Reference | Comment |
---|---|---|---|---|---|
ΔrH° | -88.53 ± 0.08 | kJ/mol | Cm | Wiberg and Hao, 1991 | liquid phase; Trifuoroacetolysis; ALS |
By formula: C2HF3O2 + C6H12 = C8H13F3O2
Quantity | Value | Units | Method | Reference | Comment |
---|---|---|---|---|---|
ΔrH° | -44.79 ± 0.13 | kJ/mol | Eqk | Wiberg and Wasserman, 1981 | liquid phase; Trifluoroacetolysis; ALS |
By formula: C2HF3O2 + C6H12 = C8H13F3O2
Quantity | Value | Units | Method | Reference | Comment |
---|---|---|---|---|---|
ΔrH° | -42.76 ± 0.13 | kJ/mol | Eqk | Wiberg and Wasserman, 1981 | liquid phase; Trifluoroacetolysis; ALS |
By formula: C6H12 + C2HF3O2 = C8H13F3O2
Quantity | Value | Units | Method | Reference | Comment |
---|---|---|---|---|---|
ΔrH° | -40.90 ± 0.13 | kJ/mol | Eqk | Wiberg and Wasserman, 1981 | liquid phase; Trifluoroacetolysis; ALS |
By formula: C6H12 + C2HF3O2 = C8H13F3O2
Quantity | Value | Units | Method | Reference | Comment |
---|---|---|---|---|---|
ΔrH° | -39.71 ± 0.13 | kJ/mol | Eqk | Wiberg and Wasserman, 1981 | liquid phase; Trifluoroacetolysis; ALS |
By formula: C6H12 + C2HF3O2 = C8H13F3O2
Quantity | Value | Units | Method | Reference | Comment |
---|---|---|---|---|---|
ΔrH° | -36.8 ± 0.3 | kJ/mol | Cm | Wiberg and Hao, 1991 | liquid phase; Trifluoroacetolysis; ALS |
By formula: C6H12 + C2HF3O2 = C8H13F3O2
Quantity | Value | Units | Method | Reference | Comment |
---|---|---|---|---|---|
ΔrH° | -50.5 ± 0.1 | kJ/mol | Eqk | Wiberg and Wasserman, 1981 | liquid phase; Trifluoroacetolysis; ALS |
By formula: C5H10 + C2HF3O2 = C7H11F3O2
Quantity | Value | Units | Method | Reference | Comment |
---|---|---|---|---|---|
ΔrH° | -45.7 ± 0.2 | kJ/mol | Cm | Wiberg and Hao, 1991 | liquid phase; Trifuoroacetolysis; ALS |
By formula: C5H10 + C2HF3O2 = C7H11F3O2
Quantity | Value | Units | Method | Reference | Comment |
---|---|---|---|---|---|
ΔrH° | -38.1 ± 0.2 | kJ/mol | Cm | Wiberg and Hao, 1991 | liquid phase; Trifluoroacetolysis; ALS |
By formula: C2HF3O2 + C6H12 = C8H13F3O2
Quantity | Value | Units | Method | Reference | Comment |
---|---|---|---|---|---|
ΔrH° | -37.7 ± 0.08 | kJ/mol | Cm | Wiberg and Hao, 1991 | liquid phase; Trifuoroacetolysis; ALS |
C5H11BrMg (solution) + (solution) = C2BrF3MgO2 (solution) +
(solution)
By formula: C5H11BrMg (solution) + C2HF3O2 (solution) = C2BrF3MgO2 (solution) + C5H12 (solution)
Quantity | Value | Units | Method | Reference | Comment |
---|---|---|---|---|---|
ΔrH° | -273.6 | kJ/mol | RSC | Holm, 1983 | solvent: Diethyl ether; MS |
By formula: C4F6O3 + C6H14O = C2HF3O2 + C8H13F3O2
Quantity | Value | Units | Method | Reference | Comment |
---|---|---|---|---|---|
ΔrH° | -89.33 ± 0.04 | kJ/mol | Cm | Wiberg and Wasserman, 1981 | liquid phase; ALS |
By formula: C4F6O3 + C6H14O = C2HF3O2 + C8H13F3O2
Quantity | Value | Units | Method | Reference | Comment |
---|---|---|---|---|---|
ΔrH° | -92.68 ± 0.04 | kJ/mol | Cm | Wiberg and Wasserman, 1981 | liquid phase; ALS |
By formula: C4F6O3 + H2O = 2C2HF3O2
Quantity | Value | Units | Method | Reference | Comment |
---|---|---|---|---|---|
ΔrH° | -75.35 ± 0.04 | kJ/mol | Cm | Wiberg and Wasserman, 1981 | liquid phase; ALS |
+
= C2F3NO4 +
By formula: C4F6O3 + HNO3 = C2F3NO4 + C2HF3O2
Quantity | Value | Units | Method | Reference | Comment |
---|---|---|---|---|---|
ΔrH° | -27.6 | kJ/mol | Cm | Tsvetkov, Shmakov, et al., 1989 | liquid phase; ALS |

Henry's Law data

Data compiled by: Rolf Sander
Henry's Law constant (water solution)
kH(T) = k°H exp(d(ln(kH))/d(1/T) ((1/T) - 1/(298.15 K)))
k°H = Henry's law constant for solubility in water at 298.15 K (mol/(kg*bar))
d(ln(kH))/d(1/T) = Temperature dependence constant (K)
k°H (mol/(kg*bar)) | d(ln(kH))/d(1/T) (K) | Method | Reference |
---|---|---|---|
8900. | 9300. | M | N/A |

Gas phase ion energetics data

Data evaluated as indicated in comments:
HL - Edward P. Hunter and Sharon G. Lias
L - Sharon G. Lias
Data compiled as indicated in comments:
B - John E. Bartmess
LLK - Sharon G. Lias, Rhoda D. Levin, and Sherif A. Kafafi
Quantity | Value | Units | Method | Reference | Comment |
---|---|---|---|---|---|
IE (evaluated) | 11.5 | eV | N/A | N/A | L |
Quantity | Value | Units | Method | Reference | Comment |
Proton affinity (review) | 711.7 | kJ/mol | N/A | Hunter and Lias, 1998 | HL |
Quantity | Value | Units | Method | Reference | Comment |
Gas basicity | 680.7 | kJ/mol | N/A | Hunter and Lias, 1998 | HL |
Ionization energy determinations
IE (eV) | Method | Reference | Comment |
---|---|---|---|
11.6 | PE | Asbrink, Svensson, et al., 1981 | LLK |
11.46 | PE | Sweigart and Turner, 1972 | LLK |
12.0 | PE | Asbrink, Svensson, et al., 1981 | Vertical value; LLK |
12.06 | PE | Carnovale, Gan, et al., 1980 | Vertical value; LLK |
12.08 ± 0.05 | PE | Coleman, Green, et al., 1979 | Vertical value; LLK |
12.00 | PE | Watanabe, Yokoyama, et al., 1973 | Vertical value; LLK |
12.00 ± 0.03 | PE | Thomas, 1972 | Vertical value; LLK |
De-protonation reactions
By formula: C2F3O2- + H+ = C2HF3O2
Quantity | Value | Units | Method | Reference | Comment |
---|---|---|---|---|---|
ΔrH° | 1355. ± 12. | kJ/mol | G+TS | Caldwell, Renneboog, et al., 1989 | gas phase; B |
ΔrH° | 1351. ± 12. | kJ/mol | G+TS | Jinfeng, Topsom, et al., 1988 | gas phase; value altered from reference due to change in acidity scale; B |
ΔrH° | 1351. ± 17. | kJ/mol | G+TS | Cumming and Kebarle, 1978 | gas phase; B |
Quantity | Value | Units | Method | Reference | Comment |
ΔrG° | 1328. ± 8.4 | kJ/mol | IMRE | Caldwell, Renneboog, et al., 1989 | gas phase; B |
ΔrG° | 1324. ± 8.4 | kJ/mol | IMRE | Jinfeng, Topsom, et al., 1988 | gas phase; value altered from reference due to change in acidity scale; B |
ΔrG° | 1323. ± 8.4 | kJ/mol | IMRE | Cumming and Kebarle, 1978 | gas phase; B |

Ion clustering data

Data compiled by: Michael M. Meot-Ner (Mautner) and Sharon G. Lias
Clustering reactions
By formula: C2H2F3O2+ + C2HF3O2 = (C2H2F3O2+ • C2HF3O2)
Bond type: Hydrogen bonds of the type OH-O between organics
Quantity | Value | Units | Method | Reference | Comment |
---|---|---|---|---|---|
ΔrH° | 123. | kJ/mol | ICR | Larson and McMahon, 1982 | gas phase; switching reaction(H3O+)H2O, Entropy change calculated or estimated; Cunningham, Payzant, et al., 1972, Lias, Liebman, et al., 1984, Keesee and Castleman, 1986 |
Quantity | Value | Units | Method | Reference | Comment |
ΔrS° | 119. | J/mol*K | N/A | Larson and McMahon, 1982 | gas phase; switching reaction(H3O+)H2O, Entropy change calculated or estimated; Cunningham, Payzant, et al., 1972, Lias, Liebman, et al., 1984, Keesee and Castleman, 1986 |
Quantity | Value | Units | Method | Reference | Comment |
ΔrG° | 87.0 | kJ/mol | ICR | Larson and McMahon, 1982 | gas phase; switching reaction(H3O+)H2O, Entropy change calculated or estimated; Cunningham, Payzant, et al., 1972, Lias, Liebman, et al., 1984, Keesee and Castleman, 1986 |

Normal alkane RI, non-polar column, temperature ramp

Column type | Active phase | I | Reference | Comment |
---|---|---|---|---|
Capillary | OV-101 | 744. | Zenkevich, 2005 | 25. m/0.20 mm/0.10 μm, N2/He, 6. K/min; Tstart: 50. C; Tend: 250. C |
Capillary | OV-101 | 730. | Zenkevich and Rodin, 2002 | Nitrogen, 60. C @ 0. min, 4. K/min, 240. C @ 0. min; Column length: 25. m; Column diameter: 0.25 mm |

References

Guthrie, 1976
Guthrie, J.P.,
Thermodynamics of ester and orthoester formation from trifluoroacetic acid,
Can. J. Chem., 1976, 54, 202-209. [all data]
Kolesov, Slavutskaya, et al., 1972
Kolesov, V.P.; Slavutskaya, G.M.; Papina, T.S.,
Standard enthalpies of formation of perfluorodi-n-butyl ether and trifluoroacetic acid,
Russ. J. Phys. Chem. (Engl. Transl.), 1972, 46, 474. [all data]
Pedley, Naylor, et al., 1986
Pedley, J.B.; Naylor, R.D.; Kirby, S.P.,
Thermochemical Data of Organic Compounds, Chapman and Hall, New York, 1986, 1-792. [all data]
Kolesov and Zenkov, 1966
Kolesov, V.P.; Zenkov, I.D.,
Standard of enthalpy of formation of trifluoroacetic acid,
Russ. J. Phys. Chem. (Engl. Transl.), 1966, 40, 743-744. [all data]
Farchan Laboratories, 1990
Farchan Laboratories,
Research Chemicals Catalog, Farchan Laboratories, Gainesville, FL, 1990, 91. [all data]
PCR Inc., 1990
PCR Inc.,
Research Chemicals Catalog 1990-1991, PCR Inc., Gainesville, FL, 1990, 1. [all data]
Weast and Grasselli, 1989
CRC Handbook of Data on Organic Compounds, 2nd Editon, Weast,R.C and Grasselli, J.G., ed(s)., CRC Press, Inc., Boca Raton, FL, 1989, 1. [all data]
Malijevska, Sysova, et al., 1986
Malijevska, I.; Sysova, M.; Vlckova, D.,
Vapour-Liquid Equilibrium in Strongly Associated Systems. The Systems Acetic Acid-Propionic Acid and Acetic Acid-Trifluoroacetic Acid,
Collect. Czech. Chem. Commun., 1986, 51, 194. [all data]
Parnes, Khotimskaya, et al., 1969
Parnes, Z.N.; Khotimskaya, G.A.; Kudryavtsev, R.V.; Lukina, M.Y.; Kursanov, D.N.,
The Behavior of Cyclopropane Hydrocarbons in Ionic Hydrogenation Reactions,
Dokl. Akad. Nauk SSSR, Ser. Khim., 1969, 184, 615-8. [all data]
Kohler, Atrops, et al., 1981
Kohler, F.; Atrops, H.; Kalali, H.; Liebermann, E.; Wilhelm, E.; Ratkovics, F.; Salamon, T.,
Molecular Interactions in Mistures of Carboxylic Acids with Amines 1. Melting Curves adn Viscosities,
J. Phys. Chem., 1981, 85, 2520-4. [all data]
Stephenson and Malanowski, 1987
Stephenson, Richard M.; Malanowski, Stanislaw,
Handbook of the Thermodynamics of Organic Compounds, 1987, https://doi.org/10.1007/978-94-009-3173-2
. [all data]
Kreglewski, 1962
Kreglewski, A.,
Bull. Pol. Acad. Sci., Ser. Sci. Chem., 1962, 10, 629. [all data]
Dykyj, 1970
Dykyj, J.,
Petrochemica, 1970, 10, 2, 51. [all data]
Boublik, Fried, et al., 1984
Boublik, T.; Fried, V.; Hala, E.,
The Vapour Pressures of Pure Substances: Selected Values of the Temperature Dependence of the Vapour Pressures of Some Pure Substances in the Normal and Low Pressure Region, 2nd ed., Elsevier, New York, 1984, 972. [all data]
Kreglewski, 1962, 2
Kreglewski, A.,
Vapour Pressures and Molar Volumes of Liquid Perfluoro-n-Octane Trifluoracetic Acid, and its Anhydride,
Bull. Acad. Pol. Sci. Ser. Sci. Chim., 1962, 10, 11-12, 629-633. [all data]
Larson and McMahon, 1982
Larson, J.W.; McMahon, T.B.,
Formation, Thermochemistry, and Relative Stabilities of Proton - Bound dimers of Oxygen n - Donor Bases from Ion Cyclotron Resonance Solvent - Exchange Equilibria Measurements,
J. Am. Chem. Soc., 1982, 104, 23, 6255, https://doi.org/10.1021/ja00387a016
. [all data]
Cunningham, Payzant, et al., 1972
Cunningham, A.J.; Payzant, J.D.; Kebarle, P.,
A Kinetic Study of the Proton Hydrate H+(H2O)n Equilibria in the Gas Phase,
J. Am. Chem. Soc., 1972, 94, 22, 7627, https://doi.org/10.1021/ja00777a003
. [all data]
Lias, Liebman, et al., 1984
Lias, S.G.; Liebman, J.F.; Levin, R.D.,
Evaluated gas phase basicities and proton affinities of molecules heats of formation of protonated molecules,
J. Phys. Chem. Ref. Data, 1984, 13, 695. [all data]
Keesee and Castleman, 1986
Keesee, R.G.; Castleman, A.W., Jr.,
Thermochemical data on Ggs-phase ion-molecule association and clustering reactions,
J. Phys. Chem. Ref. Data, 1986, 15, 1011. [all data]
Caldwell, Renneboog, et al., 1989
Caldwell, G.; Renneboog, R.; Kebarle, P.,
Gas Phase Acidities of Aliphatic Carboxylic Acids, Based on Measurements of Proton Transfer Equilibria,
Can. J. Chem., 1989, 67, 4, 661, https://doi.org/10.1139/v89-092
. [all data]
Jinfeng, Topsom, et al., 1988
Jinfeng, C.; Topsom, R.D.; Headley, A.D.; Koppel, I.; Mishima, M.; Taft, R.W.; Veji, S.,
Acidities of Substituted Acetic Acids,
J. Mol. Struct., 1988, 168, 141, https://doi.org/10.1016/0166-1280(88)80349-X
. [all data]
Cumming and Kebarle, 1978
Cumming, J.B.; Kebarle, P.,
Summary of gas phase measurements involving acids AH. Entropy changes in proton transfer reactions involving negative ions. Bond dissociation energies D(A-H) and electron affinities EA(A),
Can. J. Chem., 1978, 56, 1. [all data]
Wiberg, Wasserman, et al., 1985
Wiberg, K.B.; Wasserman, D.J.; Martin, E.J.; Murcko, M.A.,
Enthalpies of hydration of alkenes. 3. Cycloalkenes,
J. Am. Chem. Soc., 1985, 107, 6019-6022. [all data]
Calado, Dias, et al., 1981
Calado, J.C.G.; Dias, A.R.; Salema, M.S.; Martinho Simões, J.A.,
J. Chem. Soc., Dalton Trans., 1981, 1174.. [all data]
Calhorda, Carrondo, et al., 1986
Calhorda, M.J.; Carrondo, M.A.A.F.C.T.; Dias, A.R.; Domingos, A.M.T.S.; Martinho Simões, J.A.; Teixeira, C.,
Organometallics, 1986, 5, 660. [all data]
Wiberg and Hao, 1991
Wiberg, K.B.; Hao, S.,
Enthalpies of hydration of alkenes. 4. Formation of acyclic tert-alcohols,
J. Org. Chem., 1991, 56, 5108-5110. [all data]
Wiberg and Wasserman, 1981
Wiberg, K.B.; Wasserman, D.J.,
Enthalpies of hydration of alkenes. 1. The n-hexenes,
J. Am. Chem. Soc., 1981, 103, 6563-6566. [all data]
Holm, 1983
Holm, T.,
Acta Chem. Scand. B, 1983, 37, 797. [all data]
Tsvetkov, Shmakov, et al., 1989
Tsvetkov, V.G.; Shmakov, V.A.; Sopin, V.F.; Ivanov, A.V.; Ikonnikov, A.A.; Marchenko, G.N.,
Enthalpies of reaction of nitric acid with acetic and trifluoroacetic anhydrides,
J. Gen. Chem. USSR, 1989, 59, 1220-1222. [all data]
Hunter and Lias, 1998
Hunter, E.P.; Lias, S.G.,
Evaluated Gas Phase Basicities and Proton Affinities of Molecules: An Update,
J. Phys. Chem. Ref. Data, 1998, 27, 3, 413-656, https://doi.org/10.1063/1.556018
. [all data]
Asbrink, Svensson, et al., 1981
Asbrink, L.; Svensson, A.; Von Niessen, W.; Bieri, G.,
30.4 nm He(II) photoelectron spectra of organic molecules,
J. Electron Spectrosc. Relat. Phenom., 1981, 24, 293. [all data]
Sweigart and Turner, 1972
Sweigart, D.A.; Turner, D.W.,
Lone pair orbitals and their interactions studied by photoelectron spectroscopy. I. Carboxylic acids and their derivatives,
J. Am. Chem. Soc., 1972, 94, 5592. [all data]
Carnovale, Gan, et al., 1980
Carnovale, F.; Gan, T.H.; Peel, J.B.,
Photoelectron spectroscopic studies of the monomers and dimers of acetic and trifluoracetic acids,
J. Electron Spectrosc. Relat. Phenom., 1980, 20, 53. [all data]
Coleman, Green, et al., 1979
Coleman, A.W.; Green, J.C.; Hayes, A.J.; Seddon, E.A.; Lloyd, D.R.; Niwa, Y.,
A comparison of the electronic structure of some group 6A dimetal tetracarboxylates using photoelectron spectroscopy,
J. Chem. Soc. Dalton Trans., 1979, 75, 1057. [all data]
Watanabe, Yokoyama, et al., 1973
Watanabe, I.; Yokoyama, Y.; Ikeda, S.,
Lone pair ionization potentials of carboxylic acids determined by He(I) photoelectron spectroscopy,
Bull. Chem. Soc. Jpn., 1973, 46, 1959. [all data]
Thomas, 1972
Thomas, R.K.,
Photoelectron spectroscopy of hydrogen-bonded systems: spectra of monomers, dimers and mixed complexes of carboxylic acides,
Proc. R. Soc. London A:, 1972, 331, 249. [all data]
Zenkevich, 2005
Zenkevich, I.G.,
Experimentally measured retention indices., 2005. [all data]
Zenkevich and Rodin, 2002
Zenkevich, I.G.; Rodin, A.A.,
Gas Chromatographic One-Step Determination of Number of Hydroxyl Groups in Polyphenols with Mixed Derivatization Reagents,
Zh. Anal. Khim. (Rus.), 2002, 57, 7, 732-736. [all data]