sodium perchlorate
- Formula: ClNaO4
- Molecular weight: 122.440
- IUPAC Standard InChIKey: BAZAXWOYCMUHIX-UHFFFAOYSA-M
- CAS Registry Number: 7601-89-0
- Chemical structure:
View 3d structure (requires JavaScript / HTML 5) - Permanent link for this species. Use this link for bookmarking this species for future reference.

Condensed phase thermochemistry data

Quantity | Value | Units | Method | Reference | Comment |
---|---|---|---|---|---|
ΔfH°solid | -382.75 | kJ/mol | Review | Chase, 1998 | Data last reviewed in June, 1963 |
Quantity | Value | Units | Method | Reference | Comment |
S°solid | 142.26 | J/mol*K | Review | Chase, 1998 | Data last reviewed in June, 1963 |
Solid Phase Heat Capacity (Shomate Equation)
Cp° = A + B*t + C*t2 + D*t3 +
E/t2
H° − H°298.15= A*t + B*t2/2 +
C*t3/3 + D*t4/4 − E/t + F − H
S° = A*ln(t) + B*t + C*t2/2 + D*t3/3 −
E/(2*t2) + G
Cp = heat capacity (J/mol*K)
H° = standard enthalpy (kJ/mol)
S° = standard entropy (J/mol*K)
t = temperature (K) / 1000.
View plot Requires a JavaScript / HTML 5 canvas capable browser.
Temperature (K) | 298. to 581. | 581. to 1500. |
---|---|---|
A | -462.5920 | 144.2460 |
B | 2839.630 | 55.34960 |
C | -4743.320 | -8.084081 |
D | 2819.560 | 0.729437 |
E | 6.590270 | -5.216180 |
F | -312.6040 | -430.8670 |
G | -1041.200 | 297.5840 |
H | -382.7520 | -382.7520 |
Reference | Chase, 1998 | Chase, 1998 |
Comment | Data last reviewed in June, 1963 | Data last reviewed in June, 1963 |

Gas phase ion energetics data

Data compiled by: Sharon G. Lias, Rhoda D. Levin, and Sherif A. Kafafi
Appearance energy determinations
Ion | AE (eV) | Other Products | Method | Reference | Comment |
---|---|---|---|---|---|
Na+ | 10.7 ± 0.4 | ? | EI | Nikolaev, Ovchinnikov, et al., 1980 |

References

Chase, 1998
Chase, M.W., Jr.,
NIST-JANAF Themochemical Tables, Fourth Edition,
J. Phys. Chem. Ref. Data, Monograph 9, 1998, 1-1951. [all data]
Nikolaev, Ovchinnikov, et al., 1980
Nikolaev, E.N.; Ovchinnikov, K.V.; Semenov, G.A.,
Mass-spectrometric study of the composition of the vapor above alkali-metal perchlorates,
J. Gen. Chem. USSR, 1980, 51, 1460. [all data]