2-Butanone, 3,3-dimethyl-
- Formula: C6H12O
- Molecular weight: 100.1589
- IUPAC Standard InChIKey: PJGSXYOJTGTZAV-UHFFFAOYSA-N
- CAS Registry Number: 75-97-8
- Chemical structure:
View 3d structure (requires JavaScript / HTML 5) - Other names: tert-Butyl methyl ketone; Methyl tert-butyl ketone; Pinacolin; Pinacoline; Pinacolone; 2,2-Dimethyl-3-butanone; 2,2-Dimethylbutanone; 3,3-Dimethyl-2-butanone; 3,3-Dimethylbutanone; tert-C4H9COCH3; Ketone, tert-butyl methyl; 1,1,1-Trimethylacetone; t-Butyl methyl ketone; Ketone, t-butyl methyl; Methyl t-butyl ketone; Pinakolin; 1,1-Dimethylethyl methyl ketone; 3,3-Dimethyl-butan-2-one; NSC 935

Gas phase ion energetics data

Data evaluated as indicated in comments:
HL - Edward P. Hunter and Sharon G. Lias
L - Sharon G. Lias
Data compiled as indicated in comments:
B - John E. Bartmess
MM - Michael M. Meot-Ner (Mautner)
LBLHLM - Sharon G. Lias, John E. Bartmess, Joel F. Liebman, John L. Holmes, Rhoda D. Levin, and W. Gary Mallard
LLK - Sharon G. Lias, Rhoda D. Levin, and Sherif A. Kafafi
RDSH - Henry M. Rosenstock, Keith Draxl, Bruce W. Steiner, and John T. Herron
Quantity | Value | Units | Method | Reference | Comment |
---|---|---|---|---|---|
IE (evaluated) | 9.14 ± 0.03 | eV | N/A | N/A | L |
Quantity | Value | Units | Method | Reference | Comment |
Proton affinity (review) | 840.1 | kJ/mol | N/A | Hunter and Lias, 1998 | HL |
Quantity | Value | Units | Method | Reference | Comment |
Gas basicity | 808.2 | kJ/mol | N/A | Hunter and Lias, 1998 | HL |
Gas basicity at 298K
Gas basicity (review) (kJ/mol) | Reference | Comment |
---|---|---|
810.0 ± 0.4 | Decouzon, Gal, et al., 1996 | T = 338K; MM |
809.6 | Decouzon, Gal, et al., 1996 | T = T(eff) = 430K; MM |
Ionization energy determinations
IE (eV) | Method | Reference | Comment |
---|---|---|---|
9.4 | EI | Dommrose and Grutzmacher, 1987 | LBLHLM |
9.117 ± 0.005 | PE | Hernandez, Masclet, et al., 1977 | LLK |
9.17 ± 0.06 | EI | Mouvier and Hernandez, 1975 | LLK |
9.11 ± 0.01 | PE | Mouvier and Hernandez, 1975 | LLK |
9.24 | PE | Brown, 1975 | LLK |
8.88 ± 0.04 | PE | Miller, Koch, et al., 1973 | LLK |
9.14 ± 0.01 | PE | Cocksey, Eland, et al., 1971 | LLK |
9.17 ± 0.03 | PI | Watanabe, Nakayama, et al., 1962 | RDSH |
9.18 ± 0.03 | PI | Vilesov, 1960 | RDSH |
9.21 | PE | Tam, Yee, et al., 1974 | Vertical value; LLK |
Appearance energy determinations
Ion | AE (eV) | Other Products | Method | Reference | Comment |
---|---|---|---|---|---|
C2H3O+ | ~11.3 | ? | EI | Mouvier and Hernandez, 1975 | LLK |
C4H9+ | 10.02 ± 0.05 | CH3CO | EI | Holmes and Lossing, 1984 | LBLHLM |
De-protonation reactions
C6H11O- + =
By formula: C6H11O- + H+ = C6H12O
Quantity | Value | Units | Method | Reference | Comment |
---|---|---|---|---|---|
ΔrH° | 1544. ± 9.6 | kJ/mol | D-EA | Brinkman, Berger, et al., 1993 | gas phase; B |
Quantity | Value | Units | Method | Reference | Comment |
ΔrG° | 1516. ± 10. | kJ/mol | H-TS | Brinkman, Berger, et al., 1993 | gas phase; B |

Phase change data

Data compiled as indicated in comments:
BS - Robert L. Brown and Stephen E. Stein
TRC - Thermodynamics Research Center, NIST Boulder Laboratories, Chris Muzny director
AC - William E. Acree, Jr., James S. Chickos
ALS - Hussein Y. Afeefy, Joel F. Liebman, and Stephen E. Stein
DH - Eugene S. Domalski and Elizabeth D. Hearing
CAL - James S. Chickos, William E. Acree, Jr., Joel F. Liebman, Students of Chem 202 (Introduction to the Literature of Chemistry), University of Missouri -- St. Louis

Quantity Value Units Method Reference Comment
Tboil379. ± 1.KAVGN/AAverage of 33 out of 38 values; Individual data points
Quantity Value Units Method Reference Comment
Tfus220.65KN/AVorontsova and Vlasov, 1987Crystal phase 1 phase; Uncertainty assigned by TRC = 0.5 K; TRC
Tfus223.4KN/AHill and Kropa, 1933Uncertainty assigned by TRC = 2. K; TRC
Tfus220.65KN/ATimmermans and Mattaar, 1921Uncertainty assigned by TRC = 0.5 K; TRC
Quantity Value Units Method Reference Comment
Ttriple221.74KN/AAndon, Counsell, et al., 1970Uncertainty assigned by TRC = 0.05 K; TRC
Quantity Value Units Method Reference Comment
Tc562.9KN/AMajer and Svoboda, 1985
Quantity Value Units Method Reference Comment
Δvap38.kJ/molN/AMajer and Svoboda, 1985
Δvap38.3kJ/molN/AAmbrose, Ellender, et al., 1975AC
Δvap37.87 ± 0.08kJ/molVHarrop, Head, et al., 1970ht. of vaporization was from a private communication; ALS
Δvap37.9 ± 0.1kJ/molCHarrop, Head, et al., 1970AC

Enthalpy of vaporization

ΔvapH (kJ/mol) Temperature (K) Method Reference Comment
50.780441.4N/ASvoboda, Kubes, et al., 1992Value corrected to 298.15 K.; DH
33.39379.3N/AMajer and Svoboda, 1985
37.8 ± 0.1308.CSvoboda, Kubes, et al., 1992AC
37.5 ± 0.1313.CSvoboda, Kubes, et al., 1992AC
36.9 ± 0.1323.CSvoboda, Kubes, et al., 1992AC
36.7 ± 0.1328.CSvoboda, Kubes, et al., 1992AC
35.8 ± 0.1338.CSvoboda, Kubes, et al., 1992AC
35.4 ± 0.1343.CSvoboda, Kubes, et al., 1992AC
35.0 ± 0.1348.CSvoboda, Kubes, et al., 1992AC
36.9326.AStephenson and Malanowski, 1987Based on data from 311. - 381. K.; AC
34.9378.AStephenson and Malanowski, 1987Based on data from 363. - 400. K.; AC
33.8411.AStephenson and Malanowski, 1987Based on data from 396. - 509. K.; AC
33.1506.AStephenson and Malanowski, 1987Based on data from 491. - 567. K.; AC
38.3304.AStephenson and Malanowski, 1987Based on data from 289. - 402. K. See also Ambrose, Ellender, et al., 1975.; AC
36.1338.CGeiseler, Quitzsch, et al., 1973AC

Enthalpy of vaporization

ΔvapH = A exp(-βTr) (1 − Tr)β
    ΔvapH = Enthalpy of vaporization (at saturation pressure) (kJ/mol)
    Tr = reduced temperature (T / Tc)

View plot Requires a JavaScript / HTML 5 canvas capable browser.

Temperature (K) A (kJ/mol) β Tc (K) Reference Comment
298. - 378.52.20.2491562.9Majer and Svoboda, 1985

Enthalpy of fusion

ΔfusH (kJ/mol) Temperature (K) Reference Comment
11.330221.74Andon, Counsell, et al., 1970, 2DH
11.34221.7Domalski and Hearing, 1996AC

Entropy of fusion

ΔfusS (J/mol*K) Temperature (K) Reference Comment
51.10221.74Andon, Counsell, et al., 1970, 2DH
51.04221.7Domalski and Hearing, 1996CAL

In addition to the Thermodynamics Research Center (TRC) data available from this site, much more physical and chemical property data is available from the following TRC products:

Gas phase thermochemistry data

Data compiled as indicated in comments:
ALS - Hussein Y. Afeefy, Joel F. Liebman, and Stephen E. Stein
GT - Glushko Thermocenter, Russian Academy of Sciences, Moscow

Quantity Value Units Method Reference Comment
Δfgas-69.47 ± 0.21kcal/molCcbHarrop, Head, et al., 1970ht. of vaporization was from a private communication; ALS

Constant pressure heat capacity of gas

Cp,gas (cal/mol*K) Temperature (K) Reference Comment
43.499 ± 0.065385.67von Geiseler G., 1973GT
43.970 ± 0.067392.13
44.450 ± 0.067399.53
44.840 ± 0.067405.07
45.210 ± 0.067410.70

Condensed phase thermochemistry data

Data compiled as indicated in comments:
ALS - Hussein Y. Afeefy, Joel F. Liebman, and Stephen E. Stein
DH - Eugene S. Domalski and Elizabeth D. Hearing

Quantity Value Units Method Reference Comment
Δfliquid-78.523 ± 0.067kcal/molCcbHarrop, Head, et al., 1970ht. of vaporization was from a private communication; ALS
Quantity Value Units Method Reference Comment
Δcliquid-895.67 ± 0.19kcal/molCcbHarrop, Head, et al., 1970ht. of vaporization was from a private communication; Corresponding Δfliquid = -78.525 kcal/mol (simple calculation by NIST; no Washburn corrections); ALS
Quantity Value Units Method Reference Comment
liquid67.50cal/mol*KN/AAndon, Counsell, et al., 1970DH

Constant pressure heat capacity of liquid

Cp,liquid (cal/mol*K) Temperature (K) Reference Comment
49.45298.15Andon, Counsell, et al., 1970T = 10 to 360 K.; DH
49.55298.15Harrop, Head, et al., 1970DH

Normal alkane RI, non-polar column, isothermal

Data compiled by: NIST Mass Spectrometry Data Center, William E. Wallace, director

Column type CapillaryCapillaryPacked
Active phase OV-1OV-1Apieson L
Column length (m)
Carrier gas   not specified
Substrate   not specified
Column diameter (mm)
Phase thickness (μm)
Temperature (C) 60.60.120.
I 692.692.681.
ReferenceAmboni, Junkes, et al., 2002Amboni, Junkes, et al., 2002Kurdina, Markovich, et al., 1969
Comment MSDC-RI MSDC-RI MSDC-RI

References

Hunter and Lias, 1998
Hunter, E.P.; Lias, S.G.,
Evaluated Gas Phase Basicities and Proton Affinities of Molecules: An Update,
J. Phys. Chem. Ref. Data, 1998, 27, 3, 413-656, https://doi.org/10.1063/1.556018
. [all data]
Decouzon, Gal, et al., 1996
Decouzon, M.; Gal, J.E.; Herreros, M.; Marai, P.C.; Murrell, J.; Todd, J.F.J.,
On the Use of the Kinetic Method for the Determination of Proton Affinities by Fourier-Transfrom Ion Cyclotron Resonance Mass Spectrometry,
Rapid. Comm. Mass Spectrom., 1996, 10, 242. [all data]
Dommrose and Grutzmacher, 1987
Dommrose, A.; Grutzmacher, H.,
Destablized carbenium ions: A-acetyl-a,a-dimethylmethyl cations,
Int. J. Mass Spectrom. Ion Processes, 1987, 76, 95. [all data]
Hernandez, Masclet, et al., 1977
Hernandez, R.; Masclet, P.; Mouvier, G.,
Spectroscopie de photoelectrons d'aldehydes et de cetones aliphatiques,
J. Electron Spectrosc. Relat. Phenom., 1977, 10, 333. [all data]
Mouvier and Hernandez, 1975
Mouvier, G.; Hernandez, R.,
Ionisation and appearance potentials of alkylketones,
Org. Mass Spectrom., 1975, 10, 958. [all data]
Brown, 1975
Brown, R.S.,
A photoelectron investigation of acyl silanes: The photoelectron spectra of trimethylsilyl phenyl ketone and phenyl tert-butyl ketone,
Can. J. Chem., 1975, 53, 2446. [all data]
Miller, Koch, et al., 1973
Miller, L.L.; Koch, V.R.; Koenig, T.; Tuttle, M.,
Photoelectron spectroscopy and the anodic fragmentation of adamantane derivatives,
J. Am. Chem. Soc., 1973, 95, 5075. [all data]
Cocksey, Eland, et al., 1971
Cocksey, B.J.; Eland, J.H.D.; Danby, C.J.,
The effect of alkyl substitution on ionisation potential,
J. Chem. Soc., 1971, (B), 790. [all data]
Watanabe, Nakayama, et al., 1962
Watanabe, K.; Nakayama, T.; Mottl, J.,
Ionization potentials of some molecules,
J. Quant. Spectry. Radiative Transfer, 1962, 2, 369. [all data]
Vilesov, 1960
Vilesov, F.I.,
The photoionization of vapors of compounds whose molecules contain carbonyl groups,
Dokl. Phys. Chem., 1960, 132, 521, In original 1332. [all data]
Tam, Yee, et al., 1974
Tam, W.-C.; Yee, D.; Brion, C.E.,
Photoelectron spectra of some aldehydes and ketones,
J. Electron Spectrosc. Relat. Phenom., 1974, 4, 77. [all data]
Holmes and Lossing, 1984
Holmes, J.L.; Lossing, F.P.,
Heats of formation of organic radicals from appearance energies,
Int. J. Mass Spectrom. Ion Processes, 1984, 58, 113. [all data]
Brinkman, Berger, et al., 1993
Brinkman, E.A.; Berger, S.; Marks, J.; Brauman, J.I.,
Molecular Rotation and the Observation of Dipole-Bound States of Anions,
J. Chem. Phys., 1993, 99, 10, 7586, https://doi.org/10.1063/1.465688
. [all data]