Stannane, triisopropyl-
- Formula: C9H22Sn
- Molecular weight: 248.981
- IUPAC Standard InChIKey: OSKSSIAPIRATNY-UHFFFAOYSA-N
- CAS Registry Number: 759-23-9
- Chemical structure:
View 3d structure (requires JavaScript / HTML 5) - Permanent link for this species. Use this link for bookmarking this species for future reference.

Gas phase ion energetics data

Data compiled by: Sharon G. Lias, Rhoda D. Levin, and Sherif A. Kafafi
Ionization energy determinations
IE (eV) | Method | Reference | Comment |
---|---|---|---|
8.6 | PE | Beltram, Fehlner, et al., 1980 | Vertical value |

References

Beltram, Fehlner, et al., 1980
Beltram, G.; Fehlner, T.P.; Mochida, K.; Kochi, J.K.,
UV photoelectron spectra of group IV alkyl hydrides,
J. Electron Spectrosc. Relat. Phenom., 1980, 18, 153. [all data]