tert-Butyl Hydroperoxide
- Formula: C4H10O2
- Molecular weight: 90.1210
- IUPAC Standard InChIKey: CIHOLLKRGTVIJN-UHFFFAOYSA-N
- CAS Registry Number: 75-91-2
- Chemical structure:

Condensed phase thermochemistry data

Data compiled by: Hussein Y. Afeefy, Joel F. Liebman, and Stephen E. Stein
Quantity | Value | Units | Method | Reference | Comment |
---|---|---|---|---|---|
ΔfH°liquid | -70.2 ± 1.2 | kcal/mol | Ccb | Kozlov and Rabinovich, 1964 | |
Quantity | Value | Units | Method | Reference | Comment |
ΔcH°liquid | -647.6 ± 1.2 | kcal/mol | Ccb | Kozlov and Rabinovich, 1964 | Corresponding ΔfHºliquid = -70.2 kcal/mol (simple calculation by NIST; no Washburn corrections) |
ΔcH°liquid | -654.2 | kcal/mol | Ccb | Vaughan, 1951 | Corresponding ΔfHºliquid = -63.6 kcal/mol (simple calculation by NIST; no Washburn corrections) |
ΔcH°liquid | -654.0 ± 0.3 | kcal/mol | Ccb | Bell, Dickey, et al., 1949 | Corresponding ΔfHºliquid = -63.8 kcal/mol (simple calculation by NIST; no Washburn corrections) |

Phase change data

Data compiled as indicated in comments:
ALS - Hussein Y. Afeefy, Joel F. Liebman, and Stephen E. Stein
DRB - Donald R. Burgess, Jr.
Quantity | Value | Units | Method | Reference | Comment |
---|---|---|---|---|---|
ΔvapH° | 11.41 ± 0.04 | kcal/mol | V | Kozlov and Rabinovich, 1964 | ALS |
ΔvapH° | 11.5 | kcal/mol | N/A | Kozlov and Rabinovich, 1964 | DRB |
ΔvapH° | 11.5 | kcal/mol | V | Vaughan, 1951 | ALS |
Enthalpy of vaporization
ΔvapH (kcal/mol) | Temperature (K) | Method | Reference | Comment |
---|---|---|---|---|
11.130 | 153. | V | Egerton, Emte, et al., 1951 | ALS |

Gas phase ion energetics data

Data compiled as indicated in comments:
B - John E. Bartmess
LLK - Sharon G. Lias, Rhoda D. Levin, and Sherif A. Kafafi
LL - Sharon G. Lias and Joel F. Liebman
Ionization energy determinations
IE (eV) | Method | Reference | Comment |
---|---|---|---|
10.24 | PE | Batich and Adam, 1974 | Vertical value; LLK |
Appearance energy determinations
Ion | AE (eV) | Other Products | Method | Reference | Comment |
---|---|---|---|---|---|
HO2+ | 9.90 | C4H9 | EI | Holmes, Lossing, et al., 1991 | LL |
De-protonation reactions
C4H9O2- + =
By formula: C4H9O2- + H+ = C4H10O2
Quantity | Value | Units | Method | Reference | Comment |
---|---|---|---|---|---|
ΔrH° | 370.9 ± 2.1 | kcal/mol | G+TS | Clifford, Wenthold, et al., 1998 | gas phase; B |
Quantity | Value | Units | Method | Reference | Comment |
ΔrG° | 363.2 ± 2.0 | kcal/mol | IMRE | Clifford, Wenthold, et al., 1998 | gas phase; B |

Gas phase thermochemistry data

Data compiled by: Hussein Y. Afeefy, Joel F. Liebman, and Stephen E. Stein

Quantity Value Units Method Reference Comment
Δfgas-56.14kcal/molEqkKhursan and Martem'yanov, 1991hf from V. P.Komissarov's report
Δfgas-58.8 ± 1.2kcal/molCcbKozlov and Rabinovich, 1964

Reaction thermochemistry data

Data compiled by: John E. Bartmess

Individual Reactions

C4H9O2- + Hydrogen cation = tert-Butyl Hydroperoxide

By formula: C4H9O2- + H+ = C4H10O2

Quantity Value Units Method Reference Comment
Δr370.9 ± 2.1kcal/molG+TSClifford, Wenthold, et al., 1998gas phase
Quantity Value Units Method Reference Comment
Δr363.2 ± 2.0kcal/molIMREClifford, Wenthold, et al., 1998gas phase

References

Kozlov and Rabinovich, 1964
Kozlov, N.A.; Rabinovich, I.B.,
Thermodynamics of isopropylbenzene and tert-butyl hydroperoxides. I. Heat of combustion and the formation of hydroperoxides; [bond] energy of oxygen-oxygen bond,
Tr. Khim. Khim. Tekhnol., 1964, 189-193. [all data]
Vaughan, 1951
Vaughan, W.E.,
General discussion (communicated),
Discuss. Faraday Soc., 1951, 10, 330. [all data]
Bell, Dickey, et al., 1949
Bell, E.R.; Dickey, F.H.; Raley, J.H.; Rust, F.F.; Vaughan, W.E.,
Oxidation of branched-chain compounds,
Ind. Eng. Chem., 1949, 41, 2597-2604. [all data]
Egerton, Emte, et al., 1951
Egerton, A.C.; Emte, W.; Minkoff, G.J.,
Some properties of organic peroxides,
Faraday Discuss. Chem. Soc., 1951, 10, 278. [all data]
Batich and Adam, 1974
Batich, C.; Adam, W.,
The photoelectron spectra of alkylperoxides,
Tetrahedron Lett., 1974, 1467. [all data]
Holmes, Lossing, et al., 1991
Holmes, J.L.; Lossing, F.P.; Mayer, P.M.,
Heats of formation of oxygen-containing organic free radicals from appearance energy measurements,
J. Am. Chem. Soc., 1991, 113, 9723. [all data]
Clifford, Wenthold, et al., 1998
Clifford, E.P.; Wenthold, P.G.; Gareyev, R.; Lineberger, W.C.; DePuy, C.H.; Bierbaum, V.M.; Ellison, G.B.,
Photoelectron spectroscopy, gas phase acidity, and thermochemistry of tert-butyl hydroperoxide: Mechanisms for the rearrangement of peroxyl radicals,
J. Chem. Phys., 1998, 109, 23, 10293-10310, https://doi.org/10.1063/1.477725
. [all data]