Chloral
- Formula: C2HCl3O
- Molecular weight: 147.388
- IUPAC Standard InChIKey: HFFLGKNGCAIQMO-UHFFFAOYSA-N
- CAS Registry Number: 75-87-6
- Chemical structure:

Phase change data

Data compiled as indicated in comments:
BS - Robert L. Brown and Stephen E. Stein
TRC - Thermodynamics Research Center, NIST Boulder Laboratories, Chris Muzny director
ALS - Hussein Y. Afeefy, Joel F. Liebman, and Stephen E. Stein
AC - William E. Acree, Jr., James S. Chickos
Quantity | Value | Units | Method | Reference | Comment |
---|---|---|---|---|---|
Tboil | 371.0 | K | N/A | Weast and Grasselli, 1989 | BS |
Tboil | 370.90 | K | N/A | Lecat, 1926 | Uncertainty assigned by TRC = 0.5 K; TRC |
Tboil | 369.55 | K | N/A | Thorpe, 1880 | Uncertainty assigned by TRC = 0.3 K; TRC |
Quantity | Value | Units | Method | Reference | Comment |
ΔvapH° | 41. | kJ/mol | V | Wiberg, Morgan, et al., 1994 | ALS |
Enthalpy of vaporization
ΔvapH (kJ/mol) | Temperature (K) | Method | Reference | Comment |
---|---|---|---|---|
36.6 | 250. | A | Stephenson and Malanowski, 1987 | Based on data from 235. to 371. K. See also Stull, 1947.; AC |
Antoine Equation Parameters
log10(P) = A − (B / (T + C))
P = vapor pressure (bar)
T = temperature (K)
View plot Requires a JavaScript / HTML 5 canvas capable browser.
Temperature (K) | A | B | C | Reference | Comment |
---|---|---|---|---|---|
235.4 to 370.8 | 4.32856 | 1466.442 | -31.765 | Stull, 1947 | Coefficents calculated by NIST from author's data. |

Reaction thermochemistry data

Data compiled by: Hussein Y. Afeefy, Joel F. Liebman, and Stephen E. Stein
Individual Reactions
By formula: C2HCl3O + H2O = C2H3Cl3O2
Quantity | Value | Units | Method | Reference | Comment |
---|---|---|---|---|---|
ΔrH° | -51.76 ± 0.08 | kJ/mol | Cm | Wiberg, Morgan, et al., 1994 | liquid phase |
ΔrH° | -51.14 ± 0.15 | kJ/mol | Eqk | Henke, Hadad, et al., 1993 | liquid phase; solvent: Acetone |
By formula: HNaO + C2HCl3O = CHNaO2 + CHCl3
Quantity | Value | Units | Method | Reference | Comment |
---|---|---|---|---|---|
ΔrH° | -102.8 | kJ/mol | Cm | Pritchard and Skinner, 1950 | liquid phase; Heat of hydrolysis |
By formula: CH4O + C2HCl3O = 2,2,2-trichloro-1-methoxyethanol
Quantity | Value | Units | Method | Reference | Comment |
---|---|---|---|---|---|
ΔrH° | -48.1 | kJ/mol | Eqk | Jensen and Pedersen, 1971 | liquid phase; solvent: Heptane |
By formula: C3H8O + C2HCl3O = 2,2,2-trichloro-1-isopropoxyethanol
Quantity | Value | Units | Method | Reference | Comment |
---|---|---|---|---|---|
ΔrH° | -41.6 | kJ/mol | Eqk | Jensen and Pedersen, 1971 | liquid phase; solvent: Heptane |
By formula: C2H6O + C2HCl3O = C4H7Cl3O2
Quantity | Value | Units | Method | Reference | Comment |
---|---|---|---|---|---|
ΔrH° | -47.3 | kJ/mol | Eqk | Jensen and Pedersen, 1971 | liquid phase; solvent: Heptane |

Gas phase ion energetics data

Data evaluated as indicated in comments:
HL - Edward P. Hunter and Sharon G. Lias
Data compiled as indicated in comments:
LBLHLM - Sharon G. Lias, John E. Bartmess, Joel F. Liebman, John L. Holmes, Rhoda D. Levin, and W. Gary Mallard
LLK - Sharon G. Lias, Rhoda D. Levin, and Sherif A. Kafafi
Quantity | Value | Units | Method | Reference | Comment |
---|---|---|---|---|---|
Proton affinity (review) | 722.3 | kJ/mol | N/A | Hunter and Lias, 1998 | HL |
Quantity | Value | Units | Method | Reference | Comment |
Gas basicity | 690.5 | kJ/mol | N/A | Hunter and Lias, 1998 | HL |
Ionization energy determinations
IE (eV) | Method | Reference | Comment |
---|---|---|---|
10.9 | PE | Guimon, Pfister-Guillouzo, et al., 1985 | LBLHLM |
10.88 | PE | Katsumata and Kimura, 1975 | Vertical value; LLK |

Condensed phase thermochemistry data

Data compiled as indicated in comments:
ALS - Hussein Y. Afeefy, Joel F. Liebman, and Stephen E. Stein
DH - Eugene S. Domalski and Elizabeth D. Hearing
Quantity | Value | Units | Method | Reference | Comment |
---|---|---|---|---|---|
ΔfH°liquid | -218.1 | kJ/mol | Cm | Pritchard and Skinner, 1950 | Heat of hydrolysis; ALS |
Constant pressure heat capacity of liquid
Cp,liquid (J/mol*K) | Temperature (K) | Reference | Comment |
---|---|---|---|
151.5 | 298. | von Reis, 1881 | T = 294 to 383 K.; DH |

Henry's Law data

Data compiled by: Rolf Sander
Henry's Law constant (water solution)
kH(T) = k°H exp(d(ln(kH))/d(1/T) ((1/T) - 1/(298.15 K)))
k°H = Henry's law constant for solubility in water at 298.15 K (mol/(kg*bar))
d(ln(kH))/d(1/T) = Temperature dependence constant (K)
k°H (mol/(kg*bar)) | d(ln(kH))/d(1/T) (K) | Method | Reference | Comment |
---|---|---|---|---|
340000. | 3500. | M | N/A | missing citation list effective values that take into account hydration of the aldehydes: kH = ([RCHO] + [RCH(OH)2]) / p(RCHO) |

Kovats' RI, non-polar column, isothermal

Column type | Active phase | Temperature (C) | I | Reference | Comment |
---|---|---|---|---|---|
Packed | SE-30 | 150. | 715. | Tiess, 1984 | Ar, Gas Chrom Q (80-100 mesh); Column length: 3. m |

Normal alkane RI, non-polar column, temperature ramp

Column type | Active phase | I | Reference | Comment |
---|---|---|---|---|
Packed | SE-30 | 695. | MHA, 9999 | Nitrogen, Chromosorb G AW DMCS (80-100 mesh); Column length: 2. m; Tstart: 100. C; Tend: 300. C |

References

Weast and Grasselli, 1989
CRC Handbook of Data on Organic Compounds, 2nd Editon, Weast,R.C and Grasselli, J.G., ed(s)., CRC Press, Inc., Boca Raton, FL, 1989, 1. [all data]
Lecat, 1926
Lecat, M.,
New binary azeotropes second list,
Recl. Trav. Chim. Pays-Bas, 1926, 45, 620-627. [all data]
Thorpe, 1880
Thorpe, T.E.,
On the Relation Between the Molecular Weights of Substances and their Specific Gravities in the Liquid State,
J. Chem. Soc., 1880, 37, 141. [all data]
Wiberg, Morgan, et al., 1994
Wiberg, K.B.; Morgan, K.M.; Maltz, H.,
Thermochemistry of carbonyl reactions. 6. A study of hydration equilibria,
J. Am. Chem. Soc., 1994, 116, 11067-11077. [all data]
Stephenson and Malanowski, 1987
Stephenson, Richard M.; Malanowski, Stanislaw,
Handbook of the Thermodynamics of Organic Compounds, 1987, https://doi.org/10.1007/978-94-009-3173-2
. [all data]
Stull, 1947
Stull, Daniel R.,
Vapor Pressure of Pure Substances. Organic and Inorganic Compounds,
Ind. Eng. Chem., 1947, 39, 4, 517-540, https://doi.org/10.1021/ie50448a022
. [all data]
Henke, Hadad, et al., 1993
Henke, S.L.; Hadad, C.M.; Morgan, K.M.; Wiberg, K.B.; Wasserman, H.H.,
A theorectical and experimental investigation of vicinal tricarbonyl systems and their hydrates,
J. Org. Chem., 1993, 58, 2830-2839. [all data]
Pritchard and Skinner, 1950
Pritchard, H.O.; Skinner, H.A.,
The heats of hydrolysis of chloral and bromal, and the C-C bond dissociation energies in chloral and bromal,
J. Am. Chem. Soc., 1950, 1928-1931. [all data]
Jensen and Pedersen, 1971
Jensen, R.B.; Pedersen, S.B.,
Reaction between chloral and alcohols. 9. Dissociation of chloral hemiacetals of some aliphatic primary and secondary alcohols,
Acta Chem. Scand., 1971, 25, 2911-2930. [all data]
Hunter and Lias, 1998
Hunter, E.P.; Lias, S.G.,
Evaluated Gas Phase Basicities and Proton Affinities of Molecules: An Update,
J. Phys. Chem. Ref. Data, 1998, 27, 3, 413-656, https://doi.org/10.1063/1.556018
. [all data]
Guimon, Pfister-Guillouzo, et al., 1985
Guimon, G.; Pfister-Guillouzo, G.; Rima, G.; El Amine, M.; Barrau, J.,
Generation, detection and electronic structure of dimethyl germanone by photoelectron spectroscopy and quantum calculations,
Spectrosc. Lett., 1985, 18, 7. [all data]
Katsumata and Kimura, 1975
Katsumata, S.; Kimura, K.,
Photoelectron spectra and sum rule consideration. Effect of chlorine substitution on ionization energies for chloroethanes, chloroacetaldehydes and chloroacetyl chlorides,
J. Electron Spectrosc. Relat. Phenom., 1975, 6, 309. [all data]